program: Gaussian 09
title: 000031186
version: EM64L-G09RevD.01
frameworkgroup: C1[X(C16H8N2O4)]
method: RPBEPBE
basis: SDD
operation: Freq
keyword: #p
keyword: freq=noraman
keyword: PBEPBE/SDD
title: #p freq=noraman PBEPBE/SDD
converged: YES YES YES YES
title: Mulliken charges:
elementType: O O O O N N C C C C C C C C C C C C C C C C H H H H H H H H
charge: -0.201442 -0.210040 -0.205356 -0.206658 0.020012 0.018400 -0.462214 0.265089 0.312714 0.314427 0.226124 0.389744 -0.399794 -0.416172 0.266222 -0.584039 -0.391933 -0.375472 -0.414209 -0.201362 0.418776 -0.392135 0.268743 0.260047 0.309858 0.265756 0.305954 0.290051 0.236795 0.292112
chargesum: 0.00000
title: Mulliken charges with hydrogens summed into heavy atoms:
elementType: O O O O N N C C C C C C C C C C C C C C C C
charge: -0.201442 -0.210040 -0.205356 -0.206658 0.020012 0.018400 -0.462214 0.265089 0.312714 0.314427 0.226124 0.389744 -0.131051 -0.156125 0.266222 -0.274181 -0.126177 -0.069518 -0.124158 0.035433 0.418776 -0.100023
polarizability: 4.08416138e+02 -2.21576897e+00 2.50628301e+02 -2.22613432e-04 7.69647289e-03 7.25393109e+01
1716.lowfreq: -2.8424 -0.0013 -0.0007 -0.0003 2.8812 4.8218 29.4376 46.0245 57.1789
frequency: 29.4376 46.0216 57.1788 79.4381 104.3440 149.0543 178.0493 183.3562 210.6489 247.3915 258.7297 293.9072 339.6776 355.3219 379.4143 437.5950 448.2174 460.4840 478.6838 498.2776 522.3782 554.5295 564.6989 569.9862 597.1939 617.9748 643.6484 655.7429 687.2621 697.1908 702.8161 729.7502 769.5993 776.4414 788.7161 808.4029 828.0766 828.7961 863.4768 878.8202 944.3938 944.8886 949.8230 988.7495 990.3809 993.7620 1006.1687 1040.1189 1064.2545 1100.4099 1104.5059 1135.3481 1152.7313 1187.7668 1194.1249 1206.8093 1216.9146 1233.0886 1269.2152 1285.7713 1333.6236 1355.5017 1362.8448 1392.8975 1398.8770 1415.6897 1431.4743 1436.9571 1465.1187 1473.6615 1491.8041 1580.9463 1595.2479 1614.0101 1617.7348 1620.9698 3140.3106 3151.9227 3155.9627 3159.9419 3175.9112 3181.3879 3185.7858 3211.5667
redmass: 14.7659 10.6924 10.4038 6.8505 10.7326 4.7619 4.9722 4.5807 10.3819 10.7522 6.9215 5.1460 5.2633 9.5159 8.8820 3.6831 4.6994 3.2206 8.5535 7.7537 7.7087 4.1276 5.9019 6.3675 5.6411 5.8304 3.8837 9.5170 7.3125 5.9188 5.2909 10.7661 2.2908 7.1784 4.0310 6.8352 1.7967 7.2695 1.5442 1.5192 4.5606 1.4443 1.5423 6.8635 1.3836 1.3770 1.3625 2.5765 2.0500 2.7814 1.9599 2.3147 1.6777 1.8233 2.2725 4.2869 2.7560 2.1468 1.7247 2.5162 2.8115 5.7677 6.0836 3.1100 3.5876 4.1863 4.5626 4.4136 3.4844 6.4440 5.1386 7.9070 8.4120 7.5985 7.6419 7.7388 1.0887 1.0910 1.0909 1.0954 1.0930 1.0938 1.0949 1.0939
irintensity: 0.2146 2.1409 0.4566 0.0675 3.6276 5.5790 1.7464 4.8226 0.4697 0.2087 1.5710 0.6533 0.7954 0.9196 0.6216 0.7054 0.1504 0.2677 0.7659 1.0671 5.5192 0.4029 1.4799 0.3159 3.2131 5.0947 4.6010 4.4776 0.0099 6.5094 11.3790 54.8250 22.3205 4.2014 5.2083 7.1745 78.5015 14.1449 2.2621 49.7955 6.2257 0.3125 18.5551 7.8532 0.6273 0.9093 1.8734 4.1079 8.5506 9.0785 2.9676 9.0455 99.5553 129.6103 401.8618 437.8307 106.9138 20.0170 9.3286 24.6175 27.4697 110.0258 48.0802 12.5096 15.2950 11.2676 57.5456 17.4543 13.1341 46.3363 60.7732 13.2304 12.3601 21.0758 27.0520 39.6526 6.2426 4.9274 4.7684 18.0026 2.7884 2.1652 3.3894 6.9504
temp: 298.150 k
press: 1.00000 atm
elementType: 8 8 8 8 7 7 6 6 6 6 6 6 6 6 6 6 6 6 6 6 6 6 1 1 1 1 1 1 1 1
symmnumber: 1
zpe: 539994.9 jmol-1
zpe.correction: 0.205673 hartree
zpe.thermalcorrener: 0.221641 hartree
zpe.thermalcorrenthalpy: 0.222585 hartree
zpe.thermalcorrgfe: 0.160978 hartree
zpe.sumelectzpe: -1023.286121 hartree
zpe.sumelectthermal: -1023.270153 hartree
zpe.sumelectthermalent: -1023.269209 hartree
zpe.sumelectthermalfe: -1023.330816 hartree
dipole: -0.3292 4.1307 0.0002
dipole: 4.1438
quadrupole: -183.0265 -109.7099 -126.2787
quadrupole: 2.8750 0.0013 -0.0003
quadrupole: -43.3548 29.9618 13.3930 2.8750 0.0013 -0.0003
hfenergy: -1023.4917939 hartree
pointgroup: C01 [X(C16H8N2O4)]
dipole: 0.1366714 -1.6245448 0.0000763 debye
polarizability: 408.4325752|-1.521749|250.6118639|0.0002565|-0.0076954|72.5393109 unknown
InChI: InChI=1S/C16H8N2O4/c19-17(20)9-4-5-10-11-2-1-3-13-15(18(21)22)7-6-12(16(11)13)14(10)8-9/h1-8H
charge 0 multiplicity 1
30 atoms
O  4.892306 2.37314 -0.000269
O  5.251041 0.128673 0.000093
O  -6.024024 0.211759 -0.000094
O  -4.922577 2.210212 -0.00021
N  4.462604 1.153946 -0.000127
N  -4.941984 0.917495 -0.000076
C  0.997158 -0.415661 -0.000046
C  0.161425 0.750717 -0.000076
C  0.200821 -1.607735 -0.000015
C  -1.237744 0.271127 -0.000067
C  -1.213445 -1.174072 -0.000014
C  2.420352 -0.405116 -0.000054
C  0.76558 2.012295 -0.000118
C  0.842153 -2.84914 0.000005
C  2.995877 0.923387 -0.000105
C  -2.451964 0.97087 -0.000088
C  -2.415729 -1.906389 0.000016
C  3.056755 -1.698986 -0.000026
C  2.189535 2.07877 -0.000135
C  2.275379 -2.867237 0.000001
C  -3.643303 0.204257 -0.000054
C  -3.645439 -1.210631 -0.000004
H  0.183878 2.939021 -0.000143
H  0.285307 -3.791964 0.000029
H  -2.51644 2.06181 -0.000123
H  -2.410862 -3.00062 0.000048
H  4.144625 -1.7656 -0.000011
H  2.69512 3.048217 -0.000179
H  2.787719 -3.835295 0.000025
H  -4.603624 -1.736349 0.000016
