program: Gaussian 09
title: 000031201
version: EM64L-G09RevD.01
frameworkgroup: C1[X(C11H17NO3)]
method: RPBEPBE
basis: SDD
operation: Freq
keyword: #p
keyword: freq=noraman
keyword: PBEPBE/SDD
title: #p freq=noraman PBEPBE/SDD
converged: YES YES NO NO
title: Mulliken charges:
elementType: O O O N C C C C C C C C C C C H H H H H H H H H H H H H H H H H
charge: -0.349616 -0.231454 -0.278957 -0.138141 0.304409 -0.560740 -0.546608 -0.710613 -0.736451 0.448857 0.176099 -0.511786 0.296981 -0.606268 -0.615330 0.233800 0.284927 0.243837 0.230417 0.209500 0.217880 0.235194 0.208815 0.218211 0.221945 0.276787 0.230614 0.229142 0.278016 0.283558 0.227209 0.229765
chargesum: 0.00000
title: Mulliken charges with hydrogens summed into heavy atoms:
elementType: O O O N C C C C C C C C C C C
charge: -0.349616 -0.231454 -0.278957 -0.138141 0.304409 -0.042014 -0.072353 -0.048039 -0.087480 0.448857 0.176099 -0.234998 0.296981 0.131505 0.125203
polarizability: 1.88228763e+02 1.15484112e+01 1.33388257e+02 -6.48910925e+00 -3.43375821e+00 1.00413718e+02
1716.lowfreq: -9.1308 -6.0643 0.0003 0.0003 0.0004 6.4967 24.6264 40.0121 60.1373
frequency: 24.3003 39.9690 60.1169 95.4736 100.2992 114.7435 124.6375 153.4489 184.7527 191.2489 218.4964 230.4493 248.4225 271.4084 294.0216 316.6556 343.5559 364.9606 391.7345 425.4929 448.9981 478.5532 499.4078 511.8451 582.1884 598.9887 628.5604 679.3412 756.5432 792.2662 851.2153 875.5228 891.4294 903.0518 918.1468 938.4982 941.4499 974.4359 991.6088 1012.2667 1058.2081 1096.3334 1098.2673 1112.9588 1122.6494 1149.1848 1149.7076 1188.3154 1243.5322 1251.5429 1255.4859 1280.1226 1296.2490 1306.8730 1342.7762 1373.6060 1378.9436 1397.7463 1423.9026 1430.7060 1434.5662 1441.6896 1463.8522 1468.1759 1471.7568 1476.6483 1480.4469 1486.2316 1486.6502 1498.6547 1582.3747 1637.6459 1677.2946 2955.0550 2959.5164 2967.1211 2971.5586 2976.9892 2981.3154 3044.0576 3050.4514 3053.7688 3060.0816 3063.7170 3068.6788 3076.9342 3085.0934 3128.0208 3153.0558 3167.5743
redmass: 4.3341 4.0407 3.4564 1.7599 1.7214 1.1774 2.9866 3.6205 4.2436 1.0381 2.1356 1.7222 2.8909 1.8912 5.0716 2.4197 3.5194 2.6667 2.1595 3.0625 4.2033 3.5197 4.0278 3.1924 3.0579 5.4500 6.4520 11.2601 7.0934 3.2228 2.7006 2.3635 2.1676 1.5777 2.4682 1.4412 2.0682 2.6001 1.9846 1.3807 1.3827 3.2131 1.2345 2.0858 1.5388 1.4723 1.5037 1.9203 4.6863 1.6224 2.4563 2.2578 1.8758 2.4447 2.0006 3.1152 1.2227 1.2014 1.1532 1.0859 1.1718 1.0868 1.0483 1.0584 1.0474 1.0426 1.0587 1.0602 1.0442 1.1668 9.8183 7.9007 8.2785 1.0673 1.0644 1.0364 1.0374 1.0373 1.0362 1.1016 1.1020 1.0945 1.0954 1.0949 1.0995 1.0991 1.0992 1.0976 1.0955 1.0929
irintensity: 2.0864 2.6090 1.7205 1.0290 1.0869 0.1633 1.3572 3.8362 1.8091 0.1250 0.6559 1.3701 5.6364 0.7991 4.7469 1.3540 9.0061 8.5433 2.3717 4.1731 5.6942 3.9168 5.1707 7.6151 2.9846 2.9856 4.9429 20.7128 47.3230 2.8791 10.7394 20.2605 20.3708 18.6739 9.3562 1.2652 0.6382 72.5967 4.2268 2.9049 34.4735 806.8577 18.8700 266.5112 3.4171 2.9215 5.9866 36.6030 14.6404 11.9944 7.0720 14.6913 4.7404 54.8799 204.7282 85.4576 21.7828 14.0701 26.3429 9.5447 11.1946 6.8285 1.3337 11.6898 17.9499 0.1557 9.6613 18.0082 36.8875 24.8994 172.0656 312.4143 349.5364 14.9449 18.1301 40.7669 26.8209 123.9464 17.0717 40.9371 26.3668 7.9987 15.1233 23.8469 15.7015 47.9726 30.4338 1.8764 3.1738 3.3159
temp: 298.150 k
press: 1.00000 atm
elementType: 8 8 8 7 6 6 6 6 6 6 6 6 6 6 6 1 1 1 1 1 1 1 1 1 1 1 1 1 1 1 1 1
symmnumber: 1
zpe: 692605.5 jmol-1
zpe.correction: 0.263799 hartree
zpe.thermalcorrener: 0.280574 hartree
zpe.thermalcorrenthalpy: 0.281518 hartree
zpe.thermalcorrgfe: 0.218814 hartree
zpe.sumelectzpe: -708.626492 hartree
zpe.sumelectthermal: -708.609718 hartree
zpe.sumelectthermalent: -708.608774 hartree
zpe.sumelectthermalfe: -708.671478 hartree
dipole: -5.0967 -2.1310 2.8484
dipole: 6.2154
quadrupole: -78.2058 -99.9603 -90.6367
quadrupole: -16.1143 1.2342 0.7089
quadrupole: 11.3951 -10.3594 -1.0358 -16.1143 1.2342 0.7089
hfenergy: -708.890292 hartree
pointgroup: C01 [X(C11H17N1O3)]
dipole: -1.9714502 -1.1407478 0.8897741 debye
polarizability: 187.4030217|14.4082765|133.9410529|-3.7006378|4.441314|100.6866635 unknown
InChI: InChI=1S/C11H17NO3/c1-11(2)6-8(13)5-9(7-11)15-10(14)12(3)4/h5H,6-7H2,1-4H3
charge 0 multiplicity 1
32 atoms
O  -1.288544 0.535573 0.390937
O  3.000433 2.577507 0.072006
O  -1.797313 -1.17646 -1.173288
N  -3.472426 -0.14574 0.113784
C  2.197892 -1.057824 -0.020368
C  0.725173 -0.987252 0.489978
C  2.984417 0.168668 0.525204
C  2.224694 -1.064762 -1.572528
C  2.845116 -2.36339 0.504145
C  0.119604 0.384978 0.30012
C  2.319632 1.51745 0.230343
C  0.845758 1.536851 0.180076
C  -2.178044 -0.358134 -0.298643
C  -4.548566 -0.917485 -0.531503
C  -3.877046 0.826076 1.143169
H  0.694565 -1.229567 1.574354
H  0.112793 -1.743056 -0.030641
H  4.012428 0.1958 0.120787
H  3.075784 0.084525 1.629777
H  3.267356 -1.115683 -1.937047
H  1.677673 -1.940334 -1.9670
H  1.758665 -0.15929 -1.99883
H  2.862126 -2.390867 1.610501
H  2.287834 -3.250344 0.147909
H  3.887124 -2.454337 0.145511
H  0.351472 2.504118 0.047074
H  -5.265004 -0.235975 -1.028184
H  -5.09474 -1.51854 0.219926
H  -4.108068 -1.58932 -1.282498
H  -2.995268 1.344562 1.539191
H  -4.396573 0.307652 1.971827
H  -4.569947 1.572799 0.709912
