program: Gaussian 09
title: 000031158
version: EM64L-G09RevD.01
frameworkgroup: C1[X(C14H12Cl2N2)]
method: RPBEPBE
basis: SDD
operation: Freq
keyword: #p
keyword: freq=noraman
keyword: PBEPBE/SDD
title: #p freq=noraman PBEPBE/SDD
converged: NO YES NO NO
title: Mulliken charges:
elementType: Cl Cl N N C C C C C C C C C C C C C C H H H H H H H H H H H H
charge: -0.064769 -0.069796 -0.446252 -0.150801 0.431955 0.114179 0.331366 -0.433617 -0.300741 -0.776645 -0.188095 -0.212346 -0.367499 -0.366905 -0.115140 -0.191955 -0.192260 -0.119276 0.303722 0.222530 0.327358 0.215771 0.268788 0.266047 0.254664 0.254314 0.249745 0.249859 0.252908 0.252891
chargesum: 0.00000
title: Mulliken charges with hydrogens summed into heavy atoms:
elementType: Cl Cl N N C C C C C C C C C C C C C C
charge: -0.064769 -0.069796 -0.142530 -0.150801 0.431955 0.114179 0.331366 -0.211087 0.026618 -0.026040 0.066569 0.041967 -0.117754 -0.117046 -0.115140 0.060953 0.060631 -0.119276
polarizability: 3.35821471e+02 6.71902710e+00 1.55298233e+02 -2.89754213e-01 7.35280277e-01 1.14085865e+02
1716.lowfreq: -49.7866 -6.0385 -0.0021 -0.0008 0.0017 2.4748 5.0728 9.6973 31.5147
frequency: -49.7734 8.6931 31.4878 33.1688 62.2980 81.6515 91.3223 163.1901 172.2314 187.6608 257.4084 285.2714 303.6022 321.3306 331.0222 385.5694 407.6206 413.7809 439.2637 451.5258 501.9116 506.0644 557.1706 562.3236 593.1441 623.2799 626.4621 630.8045 685.7087 704.7548 714.4069 757.1863 811.3122 816.4604 827.7166 836.6919 847.4569 935.2830 937.5500 950.6760 952.8657 986.9656 992.5155 993.4301 1007.4880 1038.1410 1068.2542 1071.3040 1098.7952 1109.9890 1169.5347 1179.3078 1193.6560 1243.1454 1282.4051 1292.3510 1323.2076 1345.5429 1373.8300 1395.8925 1398.7590 1403.5494 1454.4891 1459.6778 1474.8137 1484.9347 1520.4719 1569.3972 1594.2355 1597.0038 1606.7392 1649.7127 2997.5777 3090.9728 3098.1994 3116.2227 3144.4745 3146.1038 3164.9610 3168.9381 3172.6392 3172.7386 3186.7088 3555.9106
redmass: 1.1906 2.9785 10.2383 5.0907 3.4768 7.4475 9.1202 5.9174 5.1196 9.1980 7.4905 4.9744 5.9336 6.2081 5.0300 7.2917 3.0212 3.0445 5.1145 5.4205 3.2801 2.7691 2.9568 5.1370 1.2552 6.7187 7.1820 5.7163 5.6045 3.5087 3.5629 5.7140 1.4202 1.2437 1.8433 4.0161 1.3836 1.3547 1.3281 6.4657 1.3491 1.3040 4.2133 3.8651 1.5366 1.5484 2.6463 2.4828 1.3290 1.3402 1.2426 1.1453 2.6124 3.2585 1.2587 1.3141 2.4444 5.2742 4.8388 3.9443 1.3599 3.0636 1.0635 1.6211 1.7767 1.7639 2.3428 7.8459 6.0224 5.1527 6.1714 6.2121 1.0364 1.0983 1.1001 1.0902 1.0889 1.0886 1.0906 1.0960 1.0971 1.0949 1.0960 1.0762
irintensity: 1.1611 0.2000 0.5129 0.1811 1.4309 0.0028 0.5513 2.6664 0.4726 0.2622 1.4939 4.0102 0.0806 0.3370 0.0531 13.8435 0.0025 0.0044 28.6344 0.3240 9.9116 39.6218 4.5325 17.5176 51.6403 10.9327 0.3495 8.9214 36.4676 0.7879 15.3290 2.0910 43.2896 0.4090 67.8361 8.3620 49.5355 0.6839 0.1946 11.1458 0.0293 2.2869 56.5418 12.7350 2.0200 7.2018 49.2487 29.8093 14.2975 20.0522 46.7597 5.0065 125.9936 25.8585 0.0003 7.9764 5.9194 0.7971 145.0938 0.4556 52.7044 6.3157 21.2806 133.6915 242.1248 59.0943 571.2869 0.1668 96.2306 28.1364 36.7546 680.0438 12.6491 10.6481 23.5933 16.2059 4.4855 9.3593 2.6615 9.1609 0.6999 2.9333 18.9504 24.9913
temp: 298.150 k
press: 1.00000 atm
elementType: 17 17 7 7 6 6 6 6 6 6 6 6 6 6 6 6 6 6 1 1 1 1 1 1 1 1 1 1 1 1
symmnumber: 1
zpe: 587380.3 jmol-1
zpe.correction: 0.223721 hartree
zpe.thermalcorrener: 0.239774 hartree
zpe.thermalcorrenthalpy: 0.240718 hartree
zpe.thermalcorrgfe: 0.176261 hartree
zpe.sumelectzpe: -1569.046886 hartree
zpe.sumelectthermal: -1569.030834 hartree
zpe.sumelectthermalent: -1569.029889 hartree
zpe.sumelectthermalfe: -1569.094347 hartree
dipole: 0.8196 5.1960 -0.0589
dipole: 5.2606
quadrupole: -147.5617 -106.7930 -115.6340
quadrupole: 6.7771 -0.1058 0.1467
quadrupole: -24.2322 16.5366 7.6956 6.7771 -0.1058 0.1467
hfenergy: -1569.2706073 hartree
pointgroup: C01 [X(C14H12Cl2N2)]
dipole: -0.3518819 2.0377458 -0.0858092 debye
polarizability: 335.9249373|-4.2797439|154.9364526|-3.2445262|-2.9648244|114.3441787 unknown
InChI: InChI=1S/C14H12Cl2N2/c1-10(17-13-6-2-11(15)3-7-13)18-14-8-4-12(16)5-9-14/h2-9,17H,1H3
charge 0 multiplicity 1
30 atoms
Cl -6.085666 -2.013572 0.163878
Cl 6.504505 -1.180811 -0.060701
N  -1.265074 1.65289 -0.092491
N  0.594487 0.199692 -0.046847
C  -2.353126 0.741201 -0.032785
C  0.110314 1.417597 -0.10075
C  1.988361 -0.065717 -0.052758
C  -3.663914 1.296045 -0.037795
C  -2.194169 -0.669776 0.031081
C  0.966773 2.681503 -0.159325
C  -4.799609 0.465522 0.020813
C  -3.332937 -1.50237 0.090116
C  2.697549 -0.22434 1.170813
C  2.681563 -0.271928 -1.278614
C  -4.617869 -0.930128 0.085105
C  4.068522 -0.561164 1.172516
C  4.052447 -0.609433 -1.285247
C  4.729179 -0.744501 -0.057664
H  -1.533871 2.636715 -0.133268
H  -3.801743 2.383904 -0.088168
H  -1.186382 -1.087745 0.032377
H  0.364186 3.600619 -0.259259
H  1.663748 2.628333 -1.012819
H  1.580287 2.766509 0.754703
H  -5.804517 0.896654 0.016616
H  -3.211942 -2.588408 0.139989
H  2.164245 -0.098905 2.118914
H  2.135852 -0.184932 -2.224095
H  4.609699 -0.681968 2.115566
H  4.581002 -0.767887 -2.2299
