program: Gaussian 09
title: 000031200
version: EM64L-G09RevD.01
frameworkgroup: C1[X(C9H12NO5PS)]
method: RPBEPBE
basis: SDD
operation: Freq
keyword: #p
keyword: freq=noraman
keyword: PBEPBE/SDD
title: #p freq=noraman PBEPBE/SDD
converged: YES YES NO NO
title: Mulliken charges:
elementType: S P O O O O O N C C C C C C C C C H H H H H H H H H H H H
charge: -0.199343 0.867448 -0.491643 -0.456910 -0.465322 -0.217537 -0.208575 0.021168 0.430218 0.388576 0.200589 -0.482905 -0.365107 -0.339427 -0.770187 -0.476952 -0.475789 0.277883 0.265524 0.291425 0.215566 0.257316 0.254750 0.249976 0.243452 0.244702 0.250653 0.240603 0.249850
chargesum: 0.00000
title: Mulliken charges with hydrogens summed into heavy atoms:
elementType: S P O O O O O N C C C C C C C C C
charge: -0.199343 0.867448 -0.491643 -0.456910 -0.465322 -0.217537 -0.208575 0.021168 0.430218 0.388576 0.200589 -0.205022 -0.099583 -0.048002 -0.042555 0.261178 0.265316
polarizability: 2.44179576e+02 2.63960104e+00 1.68040891e+02 4.62517363e+00 7.01354854e+00 1.17190914e+02
1716.lowfreq: -0.2984 0.0008 0.0010 0.0014 8.3797 11.8296 19.3206 23.9678 33.0128
frequency: 17.2163 23.9168 32.6201 46.9651 53.4479 81.4969 93.7464 118.2479 126.1418 133.1574 160.2132 185.7113 204.2753 225.6454 233.0560 237.6860 277.5805 282.2374 316.0727 361.6344 370.2302 389.8100 431.3395 443.5227 466.8259 516.3105 558.1665 566.8353 589.6526 661.6747 667.3164 689.7629 697.0657 725.0020 757.0878 784.0139 841.9304 879.1177 941.9308 955.9767 972.2230 984.7377 1015.8786 1041.2899 1059.1272 1113.4422 1114.9968 1131.6581 1132.3159 1137.7564 1163.7787 1203.5260 1231.5794 1279.5753 1349.0821 1383.8645 1404.4723 1417.6139 1422.9343 1424.7571 1453.6876 1457.7254 1458.9603 1466.9842 1469.2564 1470.6334 1475.3903 1580.6950 1606.8557 2988.0034 2988.8155 2998.4875 3084.4278 3094.5772 3096.3928 3100.2334 3136.8721 3139.0760 3156.2971 3174.9134 3193.4228
redmass: 5.2951 6.9591 7.3699 3.7492 3.4321 4.4193 6.5830 1.2027 1.1008 3.3840 4.0675 3.7125 6.9702 1.3187 6.0351 3.1644 7.2173 6.0417 6.7785 5.0146 5.4440 6.4947 7.4380 3.2530 9.9769 6.0830 5.0038 5.0852 6.4601 4.5598 6.9593 10.6946 12.8974 5.2070 8.4708 9.8470 1.3812 1.4805 4.0746 11.2170 8.8502 1.3254 1.5768 1.5500 4.3954 1.2413 1.2417 1.3023 1.2982 1.5763 1.6760 9.3643 4.2339 1.4560 6.0922 3.2304 2.0462 2.2419 1.1211 1.1245 1.0472 1.0530 1.0501 1.8864 1.0531 1.0538 1.4866 7.6909 6.7285 1.0301 1.0304 1.0364 1.0960 1.1049 1.1046 1.1015 1.1036 1.1038 1.0922 1.0887 1.0973
irintensity: 0.3607 0.0690 0.2301 3.0279 2.4179 4.6399 6.7293 0.6016 0.1855 4.2676 3.3718 2.3695 1.5065 2.5062 9.6701 3.9845 9.0379 10.4405 4.8993 5.7109 10.5826 7.0816 8.9747 7.4892 4.2933 9.7539 31.0599 7.8622 10.9202 41.8315 124.7031 80.6086 162.9064 3.0538 123.6114 67.5740 26.5088 29.0730 250.7218 227.8836 95.5767 0.4206 11.1928 9.3671 26.0905 0.1604 0.8795 1.9119 0.4432 34.2804 102.6668 541.5003 55.0621 7.5960 105.6934 27.7840 31.7784 31.1379 3.4495 8.0949 11.9769 8.6665 17.3050 18.8075 23.4718 14.5717 64.4682 88.0065 172.7601 47.6890 36.3807 9.6514 5.5544 20.7802 20.4892 21.5502 11.9549 9.3724 2.3118 0.9009 3.7799
temp: 298.150 k
press: 1.00000 atm
elementType: 16 15 8 8 8 8 8 7 6 6 6 6 6 6 6 6 6 1 1 1 1 1 1 1 1 1 1 1 1
symmnumber: 1
zpe: 542631.8 jmol-1
zpe.correction: 0.206678 hartree
zpe.thermalcorrener: 0.225985 hartree
zpe.thermalcorrenthalpy: 0.226930 hartree
zpe.thermalcorrgfe: 0.155663 hartree
zpe.sumelectzpe: -1518.928793 hartree
zpe.sumelectthermal: -1518.909485 hartree
zpe.sumelectthermalent: -1518.908540 hartree
zpe.sumelectthermalfe: -1518.979807 hartree
dipole: -6.9514 0.4157 -0.6845
dipole: 6.9974
quadrupole: -131.7394 -98.2428 -121.7146
quadrupole: 2.3727 -1.4441 -3.6818
quadrupole: -14.5072 18.9895 -4.4823 2.3727 -1.4441 -3.6818
hfenergy: -1519.1354701 hartree
pointgroup: C01 [X(C9H12N1O5P1S1)]
dipole: 2.7431778 0.1540981 0.1738388 debye
polarizability: 244.3109522|-3.2892147|167.5231937|0.5168307|-8.7113627|117.5772346 unknown
InChI: InChI=1S/C9H12NO5PS/c1-7-6-8(4-5-9(7)10(11)12)15-16(17,13-2)14-3/h4-6H,1-3H3
charge 0 multiplicity 1
29 atoms
S  2.708646 0.369078 -2.209198
P  2.793003 0.0098 -0.186407
O  1.496109 -0.901323 0.553438
O  4.116381 -0.901431 0.421609
O  2.821156 1.351404 0.888938
O  -4.790967 -1.22637 0.026602
O  -4.628713 1.019772 -0.281635
N  -4.094819 -0.138865 -0.067105
C  -1.769521 0.904069 0.007691
C  0.125786 -0.635102 0.360464
C  -2.623777 -0.240252 0.078069
C  -0.3808 0.666439 0.161183
C  -0.73476 -1.754414 0.429005
C  -2.112553 -1.546101 0.291872
C  -2.228129 2.332782 -0.206457
C  4.586965 -2.083234 -0.341942
C  3.84197 2.406377 0.659879
H  0.308351 1.516544 0.142942
H  -0.315613 -2.751234 0.58679
H  -2.81787 -2.379139 0.337476
H  -1.359559 3.012283 -0.201905
H  -2.766536 2.444763 -1.163117
H  -2.940827 2.652828 0.572667
H  5.556973 -2.334253 0.110729
H  4.711536 -1.836085 -1.412061
H  3.876892 -2.918537 -0.21863
H  3.549066 3.223117 1.334945
H  3.822689 2.74821 -0.391258
H  4.842221 2.025376 0.925916
