program: Gaussian 09
title: 000031123
version: EM64L-G09RevD.01
frameworkgroup: C1[X(C9H10ClNO2)]
method: RPBEPBE
basis: SDD
operation: Freq
keyword: #p
keyword: freq=noraman
keyword: PBEPBE/SDD
title: #p freq=noraman PBEPBE/SDD
converged: NO YES NO NO
title: Mulliken charges:
elementType: Cl O O N C C C C C C C C C H H H H H H H H H H
charge: -0.083075 -0.262217 -0.254318 -0.432613 0.492131 -0.453276 -0.322315 0.325175 -0.324977 -0.351636 0.242521 -0.666940 -0.538099 0.224529 0.306616 0.243009 0.252840 0.320229 0.297057 0.297032 0.220562 0.220672 0.247094
chargesum: 0.00000
title: Mulliken charges with hydrogens summed into heavy atoms:
elementType: Cl O O N C C C C C C C C C
charge: -0.083075 -0.262217 -0.254318 -0.112385 0.492131 -0.228746 -0.015700 0.325175 -0.081968 -0.098796 0.242521 -0.072851 0.150229
polarizability: 2.01630377e+02 7.73885063e+00 1.27103940e+02 2.19013518e-04 2.27979553e-02 5.63417342e+01
1716.lowfreq: -4.0086 0.0031 0.0031 0.0033 2.2201 5.7335 39.9608 52.9739 80.0461
frequency: 39.9025 52.9289 80.0427 90.5209 108.8863 173.5766 180.3777 221.7757 246.8179 334.2786 364.2877 375.0211 414.8653 416.9674 484.3407 517.9089 565.5496 596.3871 630.8445 673.2305 721.0389 730.8910 750.7090 806.3975 845.7626 849.7279 902.6489 924.3021 944.6763 983.0506 987.7393 1001.8965 1113.9058 1119.6370 1147.3296 1157.8940 1182.9127 1210.1083 1226.9780 1255.5895 1273.5036 1308.8086 1379.4241 1418.7853 1427.8237 1438.1771 1468.3899 1473.6165 1503.2496 1532.0986 1596.0794 1604.7318 1630.5592 2958.3503 3045.7131 3070.0981 3118.2919 3125.8887 3152.6797 3163.4338 3166.5548 3193.2480 3459.2519
redmass: 4.9663 4.4864 3.1504 8.4971 3.6529 9.3645 3.1285 3.9470 1.2195 6.8692 7.9749 5.0283 3.0171 7.2101 4.3334 2.5087 3.0608 5.4525 7.0079 6.4210 2.0016 1.5571 5.6735 1.3651 5.7905 1.5143 1.7033 1.3935 6.6381 1.3189 8.4131 2.6629 1.2591 1.3215 1.1102 1.3230 1.2296 3.4619 2.7595 1.1927 2.2945 1.3807 6.3733 1.1534 3.3753 1.1719 1.0499 1.0762 2.4091 2.3219 4.9098 6.5599 6.4362 1.0331 1.1039 1.0564 1.0900 1.0992 1.1096 1.0905 1.0935 1.0959 1.0764
irintensity: 2.1615 0.0658 16.0112 0.5580 5.7032 5.3644 1.7547 7.7301 0.1217 1.6120 8.1221 2.0719 0.0055 17.3349 22.2326 24.7226 3.6039 5.8681 4.4420 89.1821 19.8094 21.4272 9.8182 49.7135 1.0647 75.4043 10.3710 3.0684 1.1002 1.7394 45.0688 17.2028 0.1994 22.4128 0.4827 2.5371 56.2484 6.7215 201.9667 21.1854 20.5443 1.1019 68.0356 26.2639 0.7590 12.2094 13.7636 86.1146 139.7828 328.7454 131.8576 253.6648 3.0701 74.3280 50.8226 5.7942 19.3641 20.6521 0.9993 4.7856 10.1674 4.6099 68.8203
temp: 298.150 k
press: 1.00000 atm
elementType: 17 8 8 7 6 6 6 6 6 6 6 6 6 1 1 1 1 1 1 1 1 1 1
symmnumber: 1
zpe: 460206.2 jmol-1
zpe.correction: 0.175283 hartree
zpe.thermalcorrener: 0.187964 hartree
zpe.thermalcorrenthalpy: 0.188908 hartree
zpe.thermalcorrgfe: 0.134699 hartree
zpe.sumelectzpe: -1013.258158 hartree
zpe.sumelectthermal: -1013.245477 hartree
zpe.sumelectthermalent: -1013.244533 hartree
zpe.sumelectthermalfe: -1013.298742 hartree
dipole: -1.5339 -3.3521 0.0020
dipole: 3.6864
quadrupole: -70.9439 -84.9007 -85.6801
quadrupole: 8.9084 -0.0087 -0.0124
quadrupole: 9.5644 -4.3925 -5.1719 8.9084 -0.0087 -0.0124
hfenergy: -1013.4334409 hartree
pointgroup: C01 [X(C9H10Cl1N1O2)]
dipole: 0.7785607 1.1746894 -0.3427388 debye
dipolederiv: -0.3724491 0.087051 -0.0054974 0.377048 -0.624215 0.0843343 -0.0763139 0.1060872 -0.1838186 -1.9546137 -0.0751111 0.1399846 0.094059 -0.3086721 -0.0044027 0.097255 0.0078186 -0.3071709 -0.7752635 0.1971612 -0.016402 -0.6415915 -0.913685 0.1847109 0.189187 0.1218408 -0.3967399 -1.5494487 -0.1351738 0.1289376 -0.3183297 -0.4312333 0.062696 0.1746075 0.0490124 -0.2960563 0.8717451 -0.1070395 -0.0346222 -0.2072837 -0.0739675 0.049619 -0.0109781 0.0418254 0.0556244 0.009063 0.116931 -0.0424819 -0.0897279 0.0766882 -0.0563923 0.0080627 -0.0715383 -0.1660155 -0.0060959 -0.0769647 0.0084998 0.0452591 0.0010716 -0.0399136 -0.0208976 -0.0307623 -0.1404457 1.6111961 -0.1094462 -0.0846836 -0.4329808 0.0028206 0.0531637 -0.005226 0.0293507 0.0843474 -0.3004418 -0.0612528 0.022617 0.4073456 -0.0275502 -0.0709937 -0.0913982 -0.0361901 -0.1806512 -0.3911949 0.0588648 0.0021852 -0.2572852 0.1029938 -0.0461551 0.0787228 -0.0695767 -0.1542679 1.5262047 -0.0738235 -0.0836611 1.1788062 0.9299941 -0.2717301 -0.390912 -0.1777311 0.2498802 0.0114745 0.0140194 0.0075818 -0.3865372 0.7672507 -0.1208874 0.1059204 -0.1512613 0.1835695 0.7490367 0.1252099 -0.0615419 0.5043534 0.3357218 -0.0383309 -0.1529455 -0.0103484 0.3450338 0.0354976 0.0943565 -0.0133835 0.0897129 -0.0566126 0.0471824 -0.0120941 0.0466961 0.1545167 0.1424409 -0.0720041 0.0199472 -0.0396828 0.0890951 0.0245131 0.0120738 0.0269779 0.1708655 -0.0050368 -0.0865039 0.0337402 -0.1026698 0.0115896 0.0454816 0.0374601 0.0441104 0.154123 0.0651475 0.0556882 -0.0061256 0.0655948 -0.0203869 0.0402148 -0.0086433 0.0409797 0.1559559 0.316722 -0.0830022 0.0181574 -0.0993737 0.1848483 0.0329581 0.022094 0.03182 0.2797525 0.0504347 0.0320895 0.0384204 0.0390943 -0.0028282 0.0467162 0.0844336 0.0213217 0.0017937 0.0298556 0.0077075 -0.0502718 -0.0111832 -0.0297306 -0.0273815 -0.0933554 -0.0027245 0.0494553 0.0416424 0.0240867 0.0417008 -0.1703844 -0.0888372 -0.1023253 0.0101495 -0.1148149 -0.0409051 0.0364473 0.0125949 -0.0687483 -0.1455194 0.0152368 0.0982957 0.0486452 0.085183 -0.1405857 -0.1423638 0.0545612 0.0056474 0.1012758 0.060408 0.0086269 -0.0058474 0.0119238 0.1217389 unknown
polarizability: 201.5652586|-5.1870259|122.6221668|-9.5336217|-15.7579797|60.8886261 unknown
InChI: InChI=1S/C9H10ClNO2/c1-13-8-4-2-7(3-5-8)11-9(12)6-10/h2-5,11H,6H2,1H3
charge 0 multiplicity 1
23 atoms
Cl -4.139491 2.291642 -0.090912
O  3.918575 -0.594898 0.013631
O  -2.627584 -1.4176 0.700538
N  -1.607505 0.634673 0.12263
C  -0.219243 0.301247 0.099553
C  0.698191 1.331776 -0.219036
C  0.267496 -1.005741 0.380952
C  2.565695 -0.222472 0.021613
C  2.085493 1.080672 -0.260224
C  1.649284 -1.255675 0.339847
C  -2.675466 -0.182277 0.402592
C  -4.074697 0.441653 0.356971
C  4.901855 0.440851 -0.309457
H  0.331157 2.34274 -0.437362
H  -0.436893 -1.802753 0.625801
H  2.768541 1.89785 -0.508738
H  2.042261 -2.254258 0.553327
H  -1.848151 1.60854 -0.097803
H  -4.54861 0.357676 1.345787
H  -4.682862 -0.071027 -0.402317
H  4.868867 1.270482 0.423706
H  4.745819 0.840844 -1.330547
H  5.878169 -0.062445 -0.254851
