program: Gaussian 09
title: 000031196
version: EM64L-G09RevD.01
frameworkgroup: C1[X(C11H15BrN2O3)]
method: RPBEPBE
basis: SDD
operation: Freq
keyword: #p
keyword: freq=noraman
keyword: PBEPBE/SDD
title: #p freq=noraman PBEPBE/SDD
converged: YES YES NO NO
title: Mulliken charges:
elementType: Br O O O N N C C C C C C C C C C C H H H H H H H H H H H H H H H
charge: -0.040435 -0.215437 -0.200838 -0.228577 -0.190412 -0.383548 0.095873 -0.381237 -0.545453 0.169502 0.168611 -0.499792 0.180555 0.010580 -0.648794 -0.591858 -0.587820 0.248481 0.271016 0.228461 0.262978 0.327063 0.366452 0.237831 0.260148 0.212935 0.248853 0.265487 0.263127 0.252913 0.226139 0.217196
chargesum: 0.00000
title: Mulliken charges with hydrogens summed into heavy atoms:
elementType: Br O O O N N C C C C C C C C C C C
charge: -0.040435 -0.215437 -0.200838 -0.228577 -0.190412 -0.017096 0.095873 0.138259 -0.054013 0.169502 0.168611 -0.172729 0.180555 0.248411 0.073143 0.189668 -0.144485
polarizability: 1.93837322e+02 9.94523737e+00 1.58093382e+02 -1.28363932e+01 6.60300175e+00 1.22190094e+02
1716.lowfreq: -86.8755 -9.0752 -4.0117 -0.0008 -0.0006 -0.0005 8.5460 30.4212 39.1142
frequency: -86.8381 30.3705 39.0166 50.2700 66.7896 73.2363 104.5036 119.9136 142.7940 155.3010 156.8973 226.2228 229.6261 246.1218 278.9492 287.2246 293.2994 322.4332 348.7532 367.2997 385.7601 415.4016 436.8161 448.2531 490.0474 564.9137 600.4782 622.0356 665.4813 682.1224 706.5906 711.3581 733.1361 773.7475 832.5206 867.5276 879.7972 910.2550 932.8369 954.6178 967.3685 988.6969 1003.3564 1005.1377 1034.7818 1085.5570 1124.5909 1132.7431 1148.8284 1159.7204 1167.5648 1206.7246 1220.5380 1251.9661 1279.9719 1289.5686 1303.5055 1319.3625 1341.2729 1351.8001 1359.0878 1379.5540 1396.5914 1426.0626 1428.1106 1452.5061 1459.0142 1460.5321 1466.2304 1474.1566 1490.3550 1585.3126 1646.4124 1656.1481 1658.1633 2969.8779 2977.5952 3018.3081 3028.8603 3044.3612 3068.2992 3083.3353 3090.2136 3100.5291 3115.3014 3118.4306 3121.3780 3152.8450 3202.0313 3517.2738
redmass: 1.0369 9.6897 4.9256 3.9786 3.1525 3.7383 4.5297 4.0523 6.2421 7.7783 6.6201 3.4197 2.4996 1.6161 2.1661 4.2843 2.4261 3.1817 3.0943 9.0990 5.9623 2.3467 7.9931 3.2576 3.2499 3.6844 4.7104 2.1737 3.3572 4.1245 7.3519 4.9532 3.3201 1.8395 2.3072 2.3727 3.3923 1.5055 2.5397 1.3411 2.6072 1.3110 1.7372 1.5417 2.1621 2.1772 1.9126 1.6605 2.4744 3.1078 3.7983 1.2897 1.9390 1.6738 1.3966 1.3326 1.5462 1.7728 1.6429 2.7926 1.7228 1.8296 1.2228 1.2139 1.1708 1.0794 1.0647 1.0980 1.1061 1.0534 1.0663 10.7372 6.1415 8.1479 4.6856 1.0439 1.0591 1.0354 1.0595 1.1020 1.0879 1.0912 1.0615 1.1015 1.0987 1.1000 1.0937 1.1037 1.1141 1.0768
irintensity: 0.0029 0.3518 0.5825 0.0421 0.4437 0.5304 1.7062 2.0133 0.2963 5.3906 7.8927 0.2096 0.2010 1.1430 3.4560 5.5639 2.3357 2.1254 6.7555 29.9175 22.9151 0.9745 14.1753 16.8643 16.0584 6.9595 13.4416 6.2967 12.9853 5.4563 1.6866 9.2556 21.4338 97.6358 3.3208 5.9172 5.1375 7.4216 14.7415 80.0049 19.3952 4.2193 28.1749 49.7483 4.4745 4.9947 8.7006 21.0557 11.5392 18.9063 34.1568 37.0691 14.5885 15.4547 31.6878 7.6249 46.5814 66.3541 149.0395 142.4834 45.0269 5.6953 25.1552 119.4190 13.1274 13.4764 5.7495 20.3023 24.3927 19.7718 12.7385 355.5086 339.4174 206.1847 16.0468 27.8981 8.9164 20.0397 7.3008 11.6407 22.3733 3.1293 8.8374 3.2423 9.8019 11.9100 8.7985 0.1837 19.0401 67.4930
temp: 298.150 k
press: 1.00000 atm
elementType: 35 8 8 8 7 7 6 6 6 6 6 6 6 6 6 6 6 1 1 1 1 1 1 1 1 1 1 1 1 1 1 1
symmnumber: 1
zpe: 654851.7 jmol-1
zpe.correction: 0.249420 hartree
zpe.thermalcorrener: 0.267062 hartree
zpe.thermalcorrenthalpy: 0.268006 hartree
zpe.thermalcorrgfe: 0.202079 hartree
zpe.sumelectzpe: -775.538669 hartree
zpe.sumelectthermal: -775.521027 hartree
zpe.sumelectthermalent: -775.520082 hartree
zpe.sumelectthermalfe: -775.586009 hartree
dipole: -2.9837 0.1955 -0.6686
dipole: 3.0639
quadrupole: -123.9615 -106.3081 -115.3949
quadrupole: -2.2772 6.0295 -3.6664
quadrupole: -8.7400 8.9134 -0.1734 -2.2772 6.0295 -3.6664
hfenergy: -775.7880885 hartree
pointgroup: C01 [X(C11H15Br1N2O3)]
dipole: 1.1293062 -0.3099901 -0.2857465 debye
polarizability: 196.0381449|-0.3767931|157.3111673|12.1769915|-5.0523765|120.7714859 unknown
InChI: InChI=1S/C11H15BrN2O3/c1-4-5-11(6-7(2)12)8(15)13-10(17)14(3)9(11)16/h4,7,13H,1,5-6H2,2-3H3
charge 0 multiplicity 1
32 atoms
Br -4.390486 1.383747 0.082572
O  -0.00431 1.622529 -1.726552
O  -0.64431 -1.616732 1.77464
O  3.422228 0.546455 1.262884
N  1.732232 1.069904 -0.281248
N  1.385819 -0.565453 1.42628
C  -0.3724 -0.337763 -0.314301
C  -1.908318 -0.05223 -0.339322
C  -0.040991 -1.478995 -1.390153
C  0.433155 0.876398 -0.809533
C  0.06663 -0.877106 1.050329
C  -2.343523 1.275093 0.312792
C  2.260818 0.356306 0.822069
C  -0.732242 -2.800124 -1.143873
C  -2.022891 1.445723 1.799683
C  2.593449 2.124606 -0.872647
C  -0.081425 -3.985019 -1.043637
H  -2.238419 -0.043453 -1.391976
H  -2.407663 -0.889372 0.177838
H  1.054097 -1.634105 -1.433433
H  -0.357748 -1.055383 -2.364142
H  -2.005938 2.136546 -0.283817
H  1.747086 -1.014915 2.274429
H  -1.82823 -2.781527 -1.080386
H  -2.400926 0.598038 2.394656
H  -0.925127 1.507537 1.947543
H  -2.459288 2.3801 2.189303
H  2.248947 2.310326 -1.899707
H  3.63775 1.780787 -0.856334
H  2.516496 3.059126 -0.291281
H  -0.624948 -4.924694 -0.899375
H  1.012577 -4.051349 -1.1014
