program: Gaussian 09
title: 000031056
version: EM64L-G09RevD.01
frameworkgroup: C1[X(C13H26N2)]
method: RPBEPBE
basis: SDD
operation: Freq
keyword: #pfreq=noraman
keyword: PBEPBE/SDD
title: #p freq=noraman PBEPBE/SDD
converged: YES YES NO NO
title: Mulliken charges:
elementType: N N C C C C C C C C C C C C C H H H H H H H H H H H H H H H H H H H H H H H H H H
charge: -0.065169 -0.084714 -0.030083 -0.033857 -0.475596 -0.452494 -0.460795 -0.468763 -0.403334 -0.400980 -0.371683 -0.348092 -0.373250 -0.623950 -0.614506 0.192950 0.217538 0.190863 0.207413 0.194568 0.194155 0.193324 0.193657 0.168988 0.214395 0.210554 0.166902 0.197025 0.193409 0.197444 0.191788 0.177904 0.225882 0.229475 0.179519 0.183166 0.236954 0.218140 0.183988 0.219577 0.227690
chargesum: 0.00000
title: Mulliken charges with hydrogens summed into heavy atoms:
elementType: N N C C C C C C C C C C C C C
charge: -0.065169 -0.084714 0.162867 0.183681 -0.077321 -0.063771 -0.073813 -0.085379 -0.014102 -0.010546 0.005772 0.055693 0.035743 0.014309 0.016749
polarizability: 1.89628809e+02 -1.89069217e-01 1.38968122e+02 1.02674949e+00 7.36412428e-01 1.25242089e+02
1716.lowfreq: -0.0006 -0.0005 0.0006 2.6917 12.3747 21.7758 28.2219 40.4384 68.2505
frequency: 25.9116 39.6622 68.1873 98.3694 125.5215 144.0269 200.2304 210.9626 214.1146 238.4406 243.2416 251.4350 314.3633 324.2808 340.9204 346.1849 360.9017 403.2999 414.0310 440.3029 462.2057 475.0639 500.9442 546.6424 609.2694 752.5515 778.1282 794.8121 825.8382 835.6125 844.1605 854.3344 890.2115 913.3836 948.6413 970.7176 984.3262 1008.9118 1020.2476 1031.3614 1048.0121 1053.2670 1063.8578 1068.2399 1090.1361 1093.9998 1107.9121 1113.3229 1124.6364 1127.6018 1133.8784 1149.5843 1168.0924 1174.1941 1183.3032 1203.3478 1225.0923 1248.5666 1253.5295 1264.7238 1269.2167 1279.1800 1281.9090 1293.2647 1300.3955 1313.3023 1320.3272 1331.2523 1333.0350 1336.9523 1341.4299 1347.2695 1355.5443 1363.6638 1369.9234 1394.4353 1417.1927 1440.2515 1452.1407 1456.5642 1460.6964 1462.7218 1463.1845 1465.6589 1467.8427 1469.8549 1474.3506 1475.3646 1478.3074 1481.8790 1487.1270 2800.7214 2810.8478 2828.5391 2836.9097 2845.0161 2857.6004 2919.1257 2951.5922 2955.8355 2962.9280 2964.5577 2965.9627 2974.3627 3009.2392 3014.9435 3017.5323 3018.1654 3024.8053 3025.7447 3028.0054 3033.6956 3036.9264 3039.4213 3040.8901 3077.1189 3085.4117
redmass: 2.6551 3.4611 3.3168 2.6066 2.3902 2.4572 3.0752 2.3098 2.2879 1.2039 1.7421 1.2711 1.7860 2.8576 1.8532 2.3599 2.0836 2.7625 3.3765 3.1111 2.4913 3.0425 2.3426 2.0182 2.2964 2.3271 2.5222 1.4023 1.9881 2.0083 1.8206 2.5836 1.5106 2.4289 1.5307 1.6642 1.9458 2.1037 2.3054 1.5639 2.2804 1.7964 1.5876 1.6475 1.4139 1.6954 2.1478 2.3765 2.1405 1.6577 2.2123 1.8070 2.1980 1.3338 1.8303 1.7260 1.3913 1.3030 1.4227 2.1729 1.4267 1.2639 1.4040 1.2252 1.2543 1.3371 1.3404 1.3963 1.3594 1.4618 1.4617 1.5097 1.6258 1.5611 1.3995 1.4494 1.1455 1.1668 1.0915 1.0817 1.0501 1.0789 1.0883 1.0805 1.0798 1.0824 1.0912 1.0530 1.0857 1.0800 1.0677 1.0709 1.0703 1.0689 1.0580 1.0676 1.0601 1.0803 1.0657 1.0597 1.0699 1.0681 1.0659 1.0602 1.0906 1.0983 1.0720 1.0964 1.0981 1.0735 1.0825 1.0997 1.0965 1.0963 1.0909 1.1010 1.1004
irintensity: 0.4736 0.0469 0.1154 0.2806 0.6145 0.5769 1.6960 0.4891 0.6999 1.0141 0.4474 1.4294 0.7981 4.2076 0.4068 6.0736 2.7311 0.2948 0.9144 4.2972 0.9958 0.5715 0.5833 1.2257 0.2694 0.9487 3.6241 1.6352 14.6134 8.9073 5.5658 5.5049 2.7716 1.2187 2.9189 12.6322 12.3962 2.5842 27.1230 19.8318 2.4655 30.4633 23.0772 8.7670 8.0951 7.6848 1.9838 0.8483 10.0533 7.8284 11.1716 1.7930 10.8463 4.5720 6.0338 6.3673 0.7384 1.9760 4.9290 11.2986 5.8480 0.7020 5.2909 9.8149 6.8986 1.6779 12.2322 0.2955 1.3564 0.4027 0.5572 0.3264 1.4596 0.1300 1.3869 1.6990 2.8575 2.6315 4.8152 0.3814 17.7451 6.9090 6.1419 8.4901 23.0998 9.1491 3.5973 9.4808 8.3976 5.8093 18.4591 44.3927 92.8350 102.6632 50.4070 131.1735 247.8591 15.1536 29.7684 7.1200 59.6754 32.7167 33.4983 63.8383 0.6299 76.0950 37.3562 47.7829 69.6892 67.0702 3.1394 29.6409 48.7539 141.3838 41.9416 32.9638 49.0523
temp: 298.150 k
press: 1.00000 atm
elementType: 7 7 6 6 6 6 6 6 6 6 6 6 6 6 6 1 1 1 1 1 1 1 1 1 1 1 1 1 1 1 1 1 1 1 1 1 1 1 1 1 1
symmnumber: 1
zpe: 981279.9 jmol-1
zpe.correction: 0.373750 hartree
zpe.thermalcorrener: 0.389692 hartree
zpe.thermalcorrenthalpy: 0.390636 hartree
zpe.thermalcorrgfe: 0.330335 hartree
zpe.sumelectzpe: -619.218787 hartree
zpe.sumelectthermal: -619.202845 hartree
zpe.sumelectthermalent: -619.201900 hartree
zpe.sumelectthermalfe: -619.262202 hartree
dipole: -0.0184 0.6571 -0.9336
dipole: 1.1419
quadrupole: -90.9421 -95.8695 -95.0089
quadrupole: -2.7570 1.4130 0.8070
quadrupole: 2.9981 -1.9294 -1.0687 -2.7570 1.4130 0.8070
hfenergy: -619.5925365 hartree
pointgroup: C01 [X(C13H26N2)]
dipole: -0.0028708 0.2515563 -0.372196 debye
polarizability: 189.5799613|0.1390816|138.9907495|2.0513592|0.4874791|125.268309 unknown
InChI: InChI=1S/C13H26N2/c1-14(2)9-10-15-8-7-12-5-3-4-6-13(12)11-15/h12-13H,3-11H2,1-2H3
charge 0 multiplicity 1
41 atoms
N  -0.618616 0.00602 -0.014073
N  -4.401492 -0.391679 0.193187
C  2.207399 0.816361 -0.352469
C  1.805732 -0.54832 0.26964
C  1.072317 1.840396 -0.129408
C  3.569555 1.295297 0.201784
C  2.906918 -1.607988 0.032346
C  0.438386 -1.004334 -0.276191
C  4.676728 0.236661 -0.019155
C  4.273174 -1.132723 0.581086
C  -0.277509 1.305585 -0.649463
C  -1.959977 -0.497761 -0.401721
C  -3.10642 0.332886 0.215148
C  -4.927242 -0.605479 -1.171285
C  -5.403071 0.2566 1.064628
H  2.319631 0.659632 -1.450721
H  1.689768 -0.396978 1.364752
H  1.310197 2.795027 -0.640165
H  0.979058 2.055275 0.953752
H  3.465477 1.497403 1.288945
H  3.854631 2.254648 -0.27542
H  2.998083 -1.804034 -1.057304
H  2.618351 -2.567596 0.50692
H  0.539654 -1.215745 -1.376591
H  0.139116 -1.951503 0.212532
H  -1.079522 2.031821 -0.427243
H  -0.225452 1.200002 -1.768073
H  5.054885 -1.887901 0.368237
H  4.208691 -1.039632 1.68518
H  5.631283 0.582028 0.423888
H  4.853389 0.117412 -1.108618
H  -2.064519 -0.550219 -1.516685
H  -2.06463 -1.527404 -0.0115
H  -2.83718 0.523613 1.270402
H  -3.192787 1.328764 -0.294371
H  -5.125318 0.351729 -1.721164
H  -4.216018 -1.201262 -1.767612
H  -5.875796 -1.169214 -1.114685
H  -5.682979 1.289798 0.731854
H  -6.324494 -0.353084 1.088431
H  -5.0109 0.3246 2.094908
