program: Gaussian 09
title: 000031145
version: EM64L-G09RevD.01
frameworkgroup: C1[X(C20H23Cl2NO3S)]
method: RPBEPBE
basis: SDD
operation: Freq
keyword: #p
keyword: freq=noraman
keyword: PBEPBE/SDD
title: #p freq=noraman PBEPBE/SDD
converged: YES YES NO NO
title: Mulliken charges:
elementType: Cl Cl S O O O N C C C C C C C C C C C C C C C C C C C C H H H H H H H H H H H H H H H H H H H H H H H
charge: -0.006658 0.001320 0.642469 -0.279949 -0.287021 -0.618626 -0.114950 -0.223136 0.381767 -0.488133 -0.441960 -0.560141 0.337478 -0.656277 -0.584531 -0.639128 -0.527198 0.215571 0.184138 -0.143978 -0.233548 -0.213957 -0.534521 -0.522340 -0.048250 -0.185863 -0.093294 0.212911 0.214270 0.275985 0.233602 0.280307 0.229499 0.228064 0.332073 0.246901 0.242959 0.213658 0.218196 0.224812 0.259104 0.271312 0.308334 0.224735 0.244100 0.218057 0.228498 0.210541 0.256376 0.266420
chargesum: 0.00000
title: Mulliken charges with hydrogens summed into heavy atoms:
elementType: Cl Cl S O O O N C C C C C C C C C C C C C C C C C C C C
charge: -0.006658 0.001320 0.642469 -0.279949 -0.287021 -0.618626 -0.114950 -0.010226 0.381767 0.002122 0.071949 -0.102578 0.337478 -0.077303 -0.341572 0.017538 -0.268094 0.215571 0.184138 -0.143978 0.037764 0.094378 0.152372 0.173075 -0.048250 0.080557 -0.093294
polarizability: 4.06829073e+02 1.88002644e+01 2.62325278e+02 4.29076940e+01 -2.05600182e+01 1.86352705e+02
1716.lowfreq: -0.0012 -0.0008 0.0018 1.6446 4.3501 5.6091 7.1260 16.7333 19.4528
frequency: 5.8163 16.6666 19.4118 34.3152 37.9766 57.0062 68.8595 80.0058 98.3219 102.4309 126.5624 138.5483 145.9540 158.4201 164.6430 178.5396 180.2914 187.5401 198.2041 216.4230 231.9930 239.0737 242.4374 249.0445 284.8362 291.4317 299.4348 315.3000 327.0223 342.1341 358.8767 380.3232 413.0149 416.9296 432.0680 440.4868 440.9466 459.1397 475.3651 495.5313 505.2271 520.5765 555.3553 581.7378 592.6443 617.6781 651.3134 658.7808 700.0199 707.2360 716.2376 733.9988 739.6955 745.5208 780.7589 802.0269 807.6463 841.8493 852.4194 871.0542 890.0100 906.1626 917.0432 956.3791 978.0576 983.1077 991.6610 991.7247 1008.2835 1029.4633 1046.5916 1054.0509 1062.0407 1089.4779 1111.4809 1111.9701 1113.7202 1115.2259 1117.3351 1125.7613 1135.6263 1151.2579 1157.4235 1171.9216 1187.1446 1203.1691 1204.4044 1209.2911 1240.7978 1253.1547 1258.7580 1277.9653 1283.5843 1292.0583 1314.5124 1345.8756 1355.1169 1357.0902 1363.6594 1369.9511 1381.5637 1390.9486 1404.5422 1429.9545 1431.9687 1432.8800 1443.0952 1452.4543 1456.6025 1461.1856 1465.8029 1466.2164 1473.9530 1482.7107 1489.2912 1492.2729 1500.4065 1565.3786 1576.9806 1577.9035 1614.0825 2898.0773 2957.5222 2962.9490 2968.7269 2972.1730 2978.8220 2993.4158 3011.9816 3016.3991 3022.5976 3045.0348 3052.9933 3057.2622 3071.6008 3079.8975 3113.0630 3121.5304 3124.4866 3126.0688 3127.2092 3141.1916 3150.5013 3168.6961
redmass: 7.4051 6.7984 8.4681 5.5465 5.8108 4.7420 3.5206 2.6945 3.8542 3.7389 4.4256 6.2168 1.8361 3.6835 3.5782 4.9843 2.2232 4.9659 2.6066 1.3672 7.4455 4.0559 1.2932 4.8197 3.2014 2.7813 5.7467 3.5724 5.8931 4.3462 5.5123 2.8170 7.3437 4.3852 3.2583 5.7835 4.6226 3.0050 3.5519 4.2932 9.8472 5.0866 5.3971 4.3723 3.6769 4.7636 7.3740 4.3417 3.7934 4.1812 2.7108 3.5466 8.4543 2.5668 7.5329 2.8574 2.2904 1.3285 1.6397 1.4516 1.5956 1.7365 3.4309 3.5407 3.1342 1.3349 5.0342 4.2580 2.3333 2.1505 2.4530 2.7428 2.3407 3.7473 1.2556 1.2432 3.2144 1.5533 1.7403 1.3176 1.4961 1.4325 1.4739 1.4589 3.3149 1.9115 1.4407 1.1855 1.2827 1.3285 1.5634 2.7871 1.8783 1.2556 1.4726 1.2274 3.2673 1.6498 1.2570 11.1338 4.9088 2.8539 1.1163 1.2109 2.3450 1.1663 1.3116 1.1019 1.0626 1.0819 1.0508 1.0576 1.1083 1.0542 1.0798 1.0695 2.5796 6.7247 8.1973 8.8456 6.9741 1.0511 1.0330 1.0638 1.0739 1.0347 1.0742 1.0631 1.0554 1.0796 1.0939 1.1037 1.1017 1.1007 1.1006 1.0974 1.1101 1.0974 1.1042 1.0906 1.0913 1.0914 1.0925 1.0946
irintensity: 0.0345 0.0201 0.2446 0.4463 0.7501 3.5551 0.4588 7.0981 2.2724 2.9492 7.9060 6.3219 0.3067 2.7923 0.3677 0.7500 7.5923 0.8235 1.5355 0.2808 1.6547 1.7779 0.3990 7.3921 2.6234 5.3143 11.7409 8.7566 1.9889 2.0979 4.6031 2.4581 11.0813 10.3333 8.2476 7.9645 4.2772 6.5389 4.4552 8.2547 8.1843 20.9307 10.0072 4.6464 1.0477 10.7849 22.0241 2.2727 2.3836 1.9637 16.7214 26.1362 22.8432 27.9543 26.7889 1.1524 6.5028 37.6210 16.4907 16.2685 12.2168 11.3913 13.3993 26.2245 31.8546 6.7357 4.0690 72.9143 0.8467 6.9389 11.3976 11.7145 8.3923 76.8744 2.2345 10.0590 53.6153 23.3305 36.4430 27.1541 8.4487 2.3489 11.4449 14.5227 57.3700 21.5352 11.7788 23.3319 0.3316 9.0271 80.0644 141.6487 21.9693 10.5328 10.8504 38.6538 33.0077 12.1450 6.2433 1.1055 12.7290 7.7986 14.0619 1.4632 94.4943 14.4096 6.1504 15.3315 11.2189 11.4738 13.7530 9.2975 88.9651 28.2821 13.2458 2.8521 159.3327 8.2453 6.8170 7.5201 15.4227 100.4551 61.5925 34.1198 32.5610 96.4460 22.6169 16.0941 41.4825 54.6868 25.8579 45.6883 37.6364 2.8082 29.8014 40.1917 9.4218 29.6619 19.7218 13.5511 12.5765 5.3006 0.5467 3.3975
temp: 298.150 k
press: 1.00000 atm
elementType: 17 17 16 8 8 8 7 6 6 6 6 6 6 6 6 6 6 6 6 6 6 6 6 6 6 6 6 1 1 1 1 1 1 1 1 1 1 1 1 1 1 1 1 1 1 1 1 1 1 1
symmnumber: 1
zpe: 1018128.6 jmol-1
zpe.correction: 0.387785 hartree
zpe.thermalcorrener: 0.415821 hartree
zpe.thermalcorrenthalpy: 0.416765 hartree
zpe.thermalcorrgfe: 0.325322 hartree
zpe.sumelectzpe: -2372.390332 hartree
zpe.sumelectthermal: -2372.362296 hartree
zpe.sumelectthermalent: -2372.361352 hartree
zpe.sumelectthermalfe: -2372.452795 hartree
dipole: 1.4093 3.1505 -1.9603
dipole: 3.9692
quadrupole: -201.9783 -160.3627 -187.6285
quadrupole: 17.1473 2.2199 -2.4749
quadrupole: -18.6551 22.9605 -4.3053 17.1473 2.2199 -2.4749
hfenergy: -2372.778117 hartree
pointgroup: C01 [X(C20H23Cl2N1O3S1)]
dipole: 0.5070811 -1.222683 0.828574 debye
polarizability: 399.4828485|-32.0287303|262.960366|-51.6589822|-21.0822044|193.0638413 unknown
InChI: InChI=1S/C20H23Cl2NO3S/c1-23-8-6-13-10-19(25-2)20(26-3)12-15(13)18(23)7-9-27(24)14-4-5-16(21)17(22)11-14/h4-5,10-12,18H,6-9H2,1-3H3
charge 0 multiplicity 1
50 atoms
Cl -7.254797 -1.284552 1.263447
Cl -7.720039 1.928174 0.746424
S  -2.392153 -0.954652 -1.604099
O  5.536587 -1.962208 0.310753
O  6.403932 0.521349 -0.781655
O  -1.671419 0.320458 -2.426927
N  0.202374 1.217484 1.114868
C  0.885144 -0.076603 0.853236
C  2.358215 0.083904 0.444248
C  0.433167 2.189234 0.010006
C  0.121388 -0.883472 -0.252663
C  1.933183 2.540254 -0.179129
C  2.831858 1.309687 -0.090429
C  -1.360287 -1.023483 0.083473
C  3.243491 -1.015904 0.56946
C  0.487999 1.766757 2.459716
C  4.182328 1.38568 -0.511393
C  4.592993 -0.926109 0.166927
C  5.06741 0.296784 -0.404184
C  -3.954488 -0.16248 -0.856989
C  -4.891602 -0.936682 -0.15205
C  -4.134876 1.208116 -1.102574
C  5.091596 -3.190684 0.969903
C  7.020692 -0.441649 -1.717594
C  -6.046648 -0.295543 0.346166
C  -5.293979 1.837126 -0.601107
C  -6.245421 1.085938 0.123152
H  0.836042 -0.661461 1.794793
H  -0.149533 3.103468 0.227356
H  0.017386 1.757269 -0.919054
H  0.609512 -1.865184 -0.388023
H  0.220015 -0.333284 -1.21037
H  2.248395 3.268938 0.596091
H  2.074458 3.046403 -1.153511
H  -1.7036 -0.143069 0.653052
H  -1.660474 -1.974335 0.554681
H  2.866272 -1.94703 1.008515
H  1.564859 1.987419 2.648953
H  0.150322 1.049156 3.22986
H  -0.082892 2.703167 2.594869
H  4.582023 2.313589 -0.936016
H  -4.753367 -2.009602 0.016426
H  -3.371476 1.744547 -1.680217
H  4.737285 -2.986757 1.999076
H  5.981196 -3.836833 1.005489
H  4.289571 -3.692707 0.393619
H  8.028506 -0.042581 -1.909415
H  6.446507 -0.480813 -2.663934
H  7.079022 -1.447015 -1.269797
H  -5.469878 2.903592 -0.769229
