program: Gaussian 09
title: 000031317
version: EM64L-G09RevD.01
frameworkgroup: C1[X(C18H23NO3)]
method: RPBEPBE
basis: SDD
operation: Freq
keyword: #p
keyword: freq=noraman
keyword: PBEPBE/SDD
title: #p freq=noraman PBEPBE/SDD
converged: YES YES NO NO
title: Mulliken charges:
elementType: O O O N C C C C C C C C C C C C C C C C C C H H H H H H H H H H H H H H H H H H H H H H H
charge: -0.269988 -0.440438 -0.273831 -0.085271 0.225746 -0.144913 -0.268794 -0.148532 -0.450505 0.025412 -0.457386 -0.081332 -0.567066 -0.477197 -0.427742 0.399979 0.122556 -0.643816 -0.435577 0.146022 -0.353691 -0.519511 0.218761 0.242072 0.204730 0.192830 0.242782 0.198216 0.242818 0.200917 0.214094 0.214711 0.214242 0.200878 0.224435 0.172377 0.222825 0.189206 0.226310 0.229977 0.340137 0.240584 0.235987 0.235710 0.221275
chargesum: 0.00000
title: Mulliken charges with hydrogens summed into heavy atoms:
elementType: O O O N C C C C C C C C C C C C C C C C C C
charge: -0.269988 -0.100301 -0.273831 -0.085271 0.225746 0.073848 -0.026722 0.056198 -0.014894 0.025412 -0.016352 0.119586 -0.138261 -0.062077 -0.030930 0.399979 0.122556 -0.005476 -0.205600 0.146022 -0.113107 0.173462
polarizability: 2.36136682e+02 -3.80386764e+00 1.92971284e+02 6.41763828e+00 1.74838005e+01 1.68360054e+02
1716.lowfreq: -17.9430 -5.2610 -0.0024 0.0007 0.0009 9.5638 37.6906 58.8459 74.4600
frequency: 37.5086 58.8306 74.4577 95.1721 113.3777 139.5221 173.3509 181.5947 188.6962 208.0687 210.7775 237.3359 244.3294 270.5531 280.0976 292.3328 307.3793 318.6936 334.1006 362.2889 376.7562 401.2815 416.5938 456.9964 460.8990 493.7884 509.9934 515.9529 549.4496 555.3657 572.7944 603.1352 608.8747 622.5908 684.2970 707.9036 726.0437 745.8707 794.8077 796.8769 810.8130 839.2433 852.0229 859.6261 887.3649 909.4594 923.1397 931.7883 933.3986 963.0018 973.6373 979.5501 1005.2218 1011.5914 1025.2966 1050.8153 1073.0052 1077.2654 1084.6108 1091.5106 1110.0544 1115.3036 1116.0277 1127.8381 1146.4236 1151.6778 1159.4805 1169.6977 1170.3614 1175.1870 1191.3879 1207.0979 1215.6085 1228.4101 1243.5908 1246.3541 1255.1503 1271.3439 1291.9612 1292.6662 1313.4732 1317.8286 1323.9019 1334.6787 1340.3572 1351.7861 1354.3267 1359.6845 1369.5400 1391.7291 1405.0414 1414.1764 1436.1514 1437.2782 1448.7560 1451.0361 1455.9595 1464.2453 1465.8033 1467.2116 1469.5554 1477.2883 1490.4276 1495.5468 1603.6794 1639.9010 2810.8176 2842.6714 2892.2169 2948.2762 2954.6228 2959.4935 2971.6006 2983.2720 2984.9920 2992.7861 3008.3775 3011.6221 3018.2957 3020.4325 3052.4536 3057.4320 3062.8965 3066.2206 3085.1045 3119.6074 3123.4486 3159.4860 3551.5755
redmass: 3.2272 3.3875 3.7148 5.3628 3.4163 2.6218 2.4668 1.8001 1.6369 1.2909 1.1534 3.1417 2.6549 2.6709 4.3800 3.3723 3.1119 3.8106 3.5281 4.1463 2.9621 3.8532 3.8436 4.5314 3.3804 3.0644 3.9216 4.3790 4.1423 3.9137 3.6463 5.4509 3.9117 3.7014 4.8746 4.2884 3.3037 5.4137 1.6076 4.2727 2.0449 3.6201 2.3674 3.1295 4.4136 2.7934 1.7867 1.7896 3.0471 2.0635 4.3850 2.5904 2.2224 2.7652 2.3079 2.3499 2.7071 2.1611 2.1282 2.1767 1.6025 1.2619 1.7833 1.7558 1.5230 2.1635 1.4101 1.6038 1.5809 1.4115 1.6860 1.3890 1.4318 1.4832 2.0929 1.7770 2.1371 1.5902 1.3015 1.9512 1.4847 1.5575 1.3465 1.5236 1.5279 1.4577 1.3967 1.4477 1.4406 1.4719 7.1118 4.8135 1.2314 1.1734 1.1027 1.0953 1.0502 1.0893 1.0914 1.0527 1.0523 1.0574 3.0206 1.0811 9.9020 8.3677 1.0720 1.0587 1.0828 1.0800 1.0672 1.0820 1.0651 1.0632 1.0300 1.0632 1.0711 1.0856 1.0939 1.0996 1.0885 1.1005 1.0989 1.1004 1.1043 1.1042 1.0885 1.0944 1.0661
irintensity: 5.1123 1.2967 0.2781 4.0851 2.9661 1.4462 0.3615 3.0157 4.1916 45.5589 78.4469 0.5435 0.7529 2.4329 3.3795 1.4608 4.5570 2.3423 3.2098 2.0166 0.9618 1.3487 7.6349 10.9234 2.4105 1.6702 0.8517 4.9538 1.4358 3.8221 5.4465 0.7339 2.2638 1.1301 5.7843 2.9586 7.0768 1.9259 23.6962 25.4832 14.9412 42.3693 11.6510 3.1748 3.8309 13.8990 7.5748 5.5145 30.7794 2.1300 37.4116 8.7053 28.2488 44.8904 18.1149 8.0952 48.8125 8.9248 16.1898 10.8221 1.8684 0.3150 7.9046 20.0353 9.1006 14.5468 6.9100 25.0499 5.8181 2.7619 37.3554 1.0673 10.8371 2.3743 53.2858 22.3025 54.5109 16.9575 0.5826 7.2014 8.7477 1.9461 11.7591 1.1453 12.0271 7.3550 7.6501 6.2971 8.6895 8.4800 19.1373 30.2414 6.2103 3.8498 19.0736 14.4457 10.3188 3.7646 14.7081 18.7745 42.9476 8.3824 83.7250 5.7337 43.6297 18.7058 90.7657 196.7788 81.1310 35.7761 54.7137 51.1649 80.7468 28.6977 72.8317 35.8971 41.5111 52.4355 29.5454 45.4077 27.5132 35.2241 40.3868 34.3664 32.1985 36.9441 14.2704 14.8745 6.4709
temp: 298.150 k
press: 1.00000 atm
elementType: 8 8 8 7 6 6 6 6 6 6 6 6 6 6 6 6 6 6 6 6 6 6 1 1 1 1 1 1 1 1 1 1 1 1 1 1 1 1 1 1 1 1 1 1 1
symmnumber: 1
zpe: 990829.7 jmol-1
zpe.correction: 0.377387 hartree
zpe.thermalcorrener: 0.396658 hartree
zpe.thermalcorrenthalpy: 0.397602 hartree
zpe.thermalcorrgfe: 0.331583 hartree
zpe.sumelectzpe: -978.434187 hartree
zpe.sumelectthermal: -978.414916 hartree
zpe.sumelectthermalent: -978.413972 hartree
zpe.sumelectthermalfe: -978.479992 hartree
dipole: -3.0178 4.6414 -0.9333
dipole: 5.6143
quadrupole: -126.2620 -122.7985 -125.5158
quadrupole: 7.7369 -1.2500 -0.0872
quadrupole: -1.4032 2.0602 -0.6570 7.7369 -1.2500 -0.0872
hfenergy: -978.8115743 hartree
pointgroup: C01 [X(C18H23N1O3)]
dipole: 1.309843 1.7495431 0.3200481 debye
polarizability: 235.9087227|1.6236781|190.4257146|7.848776|-19.1855911|171.1335834 unknown
InChI: InChI=1S/C18H23NO3/c1-19-8-7-18-11-4-5-13(20)17(18)22-16-14(21-2)6-3-10(15(16)18)9-12(11)19/h3,6,11-13,17,20H,4-5,7-9H2,1-2H3
charge 0 multiplicity 1
45 atoms
O  -1.567124 0.687453 -1.405646
O  -1.669695 2.054156 0.903416
O  -3.839284 -1.300041 -0.492908
N  3.015525 -1.212079 -0.367238
C  0.734842 0.463243 -0.693121
C  1.841319 0.900935 0.298072
C  -0.340387 1.517069 -1.10293
C  2.516865 -0.416016 0.801828
C  1.422997 -0.163225 -1.964936
C  -0.167042 -0.557094 -0.009619
C  1.293133 1.830248 1.396672
C  -0.673914 2.603485 -0.035304
C  1.562669 -1.314141 1.644457
C  0.600444 3.040479 0.728039
C  2.888564 -0.574722 -1.690558
C  0.185035 -1.446725 1.009205
C  -1.470337 -0.428546 -0.515846
C  4.311478 -1.861457 -0.131199
C  -0.836241 -2.334373 1.445759
C  -2.49741 -1.292096 -0.081182
C  -2.1339 -2.266818 0.892717
C  -4.363398 -0.074145 -1.123584
H  2.61402 1.477188 -0.252911
H  -0.089639 2.024598 -2.049782
H  3.37637 -0.121335 1.450062
H  1.413284 0.567503 -2.798277
H  0.844366 -1.045073 -2.289418
H  2.117001 2.172358 2.05246
H  0.556161 1.300888 2.02827
H  -1.115552 3.478898 -0.558453
H  1.455758 -0.892067 2.666902
H  2.041521 -2.305098 1.763544
H  0.320146 3.803011 1.482499
H  1.302453 3.53534 0.024908
H  3.207711 -1.310789 -2.453199
H  3.56762 0.311015 -1.812154
H  4.285426 -2.423624 0.820228
H  5.170557 -1.143588 -0.076902
H  4.523982 -2.584352 -0.94034
H  -0.630105 -3.067313 2.234885
H  -1.878686 2.755218 1.572107
H  -2.925678 -2.939884 1.237992
H  -3.889219 0.103021 -2.104454
H  -4.188467 0.803775 -0.476405
H  -5.441771 -0.260182 -1.245456
