program: Gaussian 09
title: 000031034
version: EM64L-G09RevD.01
frameworkgroup: C1[X(C20H18ClNO)]
method: RPBEPBE
basis: SDD
operation: Freq
keyword: #p
keyword: freq=noraman
keyword: PBEPBE/SDD
title: #p freq=noraman PBEPBE/SDD
converged: YES YES NO NO
title: Mulliken charges:
elementType: Cl O N C C C C C C C C C C C C C C C C C C C C H H H H H H H H H H H H H H H H H H
charge: -0.083844 -0.454847 -0.192909 0.117919 -0.465180 0.481614 0.528943 -0.744274 0.329523 -0.349963 -0.433369 -0.459486 -0.348493 -0.334152 -0.120839 -0.203813 -0.228026 -0.242207 -0.176937 -0.260050 -0.246867 -0.351504 -0.177087 0.215849 0.201932 0.252991 0.242630 0.371329 0.246039 0.279307 0.224427 0.250600 0.240430 0.229314 0.224728 0.224127 0.243172 0.254936 0.227716 0.249607 0.236713
chargesum: 0.00000
title: Mulliken charges with hydrogens summed into heavy atoms:
elementType: Cl O N C C C C C C C C C C C C C C C C C C C C
charge: -0.083844 -0.083517 -0.192909 0.117919 -0.249330 0.481614 0.528943 -0.046722 0.329523 -0.103924 -0.154062 -0.235059 -0.097892 -0.093722 -0.120839 0.025501 -0.003298 -0.018080 0.066235 -0.005114 -0.019151 -0.101896 0.059626
polarizability: 2.62801970e+02 2.23597204e+01 2.13533455e+02 -1.29670259e+01 2.91805284e+01 2.01970165e+02
1716.lowfreq: -8.1781 -4.7493 -0.0003 0.0013 0.0013 6.2716 19.9929 31.6868 38.8611
frequency: 19.9861 31.6078 38.6698 46.8629 54.6614 61.3369 111.5287 144.2043 166.7443 188.4406 208.1993 220.6526 234.7215 244.1745 274.6853 286.4903 297.9353 318.0989 334.1424 380.7632 402.1548 404.9074 428.7383 450.1565 474.1348 480.1246 507.5575 569.6679 609.8185 615.3531 624.4346 638.4397 655.8119 695.2133 700.5548 708.0069 747.8945 755.9187 766.5546 793.6076 806.9381 815.2200 844.4644 853.7385 871.0166 878.7060 885.8871 903.2305 909.8876 925.7325 939.1397 964.1818 971.1022 982.9993 985.0406 990.5721 993.1416 995.9593 1003.3720 1027.9346 1042.5659 1062.0802 1077.0409 1081.5456 1084.7932 1092.5659 1097.8584 1131.2929 1168.6042 1170.8029 1171.2682 1192.0565 1193.6647 1196.6934 1207.2133 1257.7908 1274.0264 1284.7760 1302.7816 1331.7668 1343.4650 1370.5142 1383.5544 1385.7213 1406.7664 1417.0932 1440.7021 1450.9481 1456.4379 1458.4678 1472.1209 1478.6888 1484.0085 1566.0390 1569.5762 1590.6033 1590.9743 1603.3851 1609.3471 2930.0638 2994.3731 3021.5862 3092.7321 3109.9284 3111.5412 3126.4321 3137.2384 3138.1661 3139.4272 3141.0357 3144.4389 3157.2843 3159.5278 3167.2566 3171.6438 3175.6461 3177.4422
redmass: 7.3005 4.8068 4.0843 5.5324 5.1522 4.6970 5.1389 5.8690 4.0402 5.1043 2.2570 1.5445 5.4265 4.1630 3.3810 3.5283 7.0189 5.8964 4.1640 8.3145 2.7861 3.3621 3.3657 4.0312 4.1577 3.5222 3.6987 5.1753 4.6038 5.6241 6.1161 6.1823 5.7610 4.0732 1.6405 2.7164 2.0106 2.3562 2.3122 1.4235 3.3171 3.3265 1.2607 2.8415 1.4656 1.4672 1.9353 1.5492 1.7240 1.3356 1.8597 1.4565 1.3937 4.9559 6.8285 4.9933 1.3855 1.3988 1.3463 2.2431 2.3275 2.7339 1.9425 1.7416 1.7762 1.7820 2.0637 2.0425 1.0735 1.0835 1.0657 1.5433 1.6416 2.7854 1.7919 2.4006 1.5539 1.3533 2.3435 1.6184 1.5386 7.4302 6.0174 1.2130 2.9367 1.9429 2.0985 1.2481 2.1240 1.7214 1.0976 1.8621 1.4187 5.9949 6.5702 5.7672 5.8871 7.1028 6.0521 1.0692 1.0359 1.0827 1.0985 1.0876 1.1004 1.0865 1.0879 1.0873 1.0928 1.0914 1.0903 1.0974 1.0954 1.0920 1.0975 1.0980 1.1015
irintensity: 0.8168 1.1250 0.0860 0.7308 0.4457 0.1560 0.0215 2.8456 2.8076 0.1728 0.5128 0.3703 0.5422 1.6150 2.5695 0.1072 4.4449 2.2099 4.3708 6.5998 0.1063 3.2075 4.6642 2.8583 2.7826 1.8467 7.7945 6.7606 12.3543 10.0137 11.2764 1.8124 17.3371 18.2319 54.1014 40.8835 50.8536 40.7044 13.7844 46.0887 18.5200 5.3329 10.0829 13.5360 74.4247 47.5913 3.6789 4.0970 18.4517 9.0524 7.7777 0.2121 1.9582 5.5324 5.4199 1.2941 0.1013 3.0778 0.0938 5.1163 3.3406 34.8488 3.8867 3.4608 9.6422 4.2905 29.4784 15.4996 2.6908 2.6796 0.2115 0.8503 1.4244 41.1135 12.6200 15.0388 19.0355 10.6907 10.8689 8.2444 1.7943 5.4133 0.7385 14.9772 22.7447 42.2535 9.8075 10.2748 57.6603 24.7959 37.1205 45.8203 77.9467 15.9281 40.4217 27.0862 18.7113 31.2224 6.7357 661.2846 8.3173 11.7799 17.2316 10.6053 25.4289 0.3459 11.7872 6.0260 30.3539 4.8140 5.3634 37.7650 17.3535 0.5248 7.1969 11.6706 16.8092
temp: 298.150 k
press: 1.00000 atm
elementType: 17 8 7 6 6 6 6 6 6 6 6 6 6 6 6 6 6 6 6 6 6 6 6 1 1 1 1 1 1 1 1 1 1 1 1 1 1 1 1 1 1
symmnumber: 1
zpe: 848371.2 jmol-1
zpe.correction: 0.323128 hartree
zpe.thermalcorrener: 0.343091 hartree
zpe.thermalcorrenthalpy: 0.344035 hartree
zpe.thermalcorrgfe: 0.272694 hartree
zpe.sumelectzpe: -1361.347200 hartree
zpe.sumelectthermal: -1361.327237 hartree
zpe.sumelectthermalent: -1361.326293 hartree
zpe.sumelectthermalfe: -1361.397634 hartree
dipole: -1.3816 3.5008 -2.1403
dipole: 4.3296
quadrupole: -142.7124 -126.0470 -140.6819
quadrupole: 5.7554 7.4120 3.1837
quadrupole: -6.2320 10.4335 -4.2015 5.7554 7.4120 3.1837
hfenergy: -1361.6703278 hartree
pointgroup: C01 [X(C20H18Cl1N1O1)]
dipole: -0.3932854 -1.5845699 0.485812 debye
polarizability: 266.6382207|-18.8272609|195.3817538|9.7719252|27.777843|216.2856154 unknown
InChI: InChI=1S/C20H18ClNO/c1-20(23,16-10-7-11-17(21)14-16)19(15-8-3-2-4-9-15)18-12-5-6-13-22-18/h2-14,19,23H,1H3
charge 0 multiplicity 1
41 atoms
Cl 4.247976 1.741445 2.63633
O  -0.165043 0.577678 -2.10451
N  -0.234734 -1.818211 -1.000868
C  0.145192 1.081181 -0.767546
C  -0.653481 0.241761 0.326403
C  1.668682 0.978581 -0.484863
C  -2.17058 0.474378 0.29586
C  -0.27882 2.563651 -0.761339
C  -0.324509 -1.251125 0.24715
C  2.200532 1.341769 0.780856
C  2.559725 0.572767 -1.507558
C  -2.787149 1.169399 1.367755
C  -2.984175 0.014766 -0.772878
C  -0.145958 -2.03348 1.414246
C  3.588048 1.273134 0.991685
C  3.951527 0.514492 -1.270879
C  -4.180131 1.406636 1.376984
C  -4.376413 0.251583 -0.765545
C  0.117215 -3.414204 1.29381
C  4.487723 0.862224 -0.009697
C  -4.981405 0.946973 0.307419
C  0.024629 -3.150605 -1.114326
C  0.202196 -3.990169 0.004983
H  -0.300747 0.591559 1.313719
H  -0.087716 3.041434 0.216404
H  -1.350372 2.649887 -1.00298
H  0.299172 3.101365 -1.53177
H  -0.184556 -0.443156 -2.013269
H  1.55214 1.688669 1.592334
H  2.141826 0.323138 -2.486828
H  -2.171314 1.533491 2.200349
H  -2.526534 -0.515583 -1.612509
H  -0.21567 -1.560018 2.398647
H  4.630352 0.200605 -2.071609
H  -4.636753 1.947106 2.213887
H  -4.990499 -0.104797 -1.600493
H  0.2574 -4.030564 2.187951
H  5.563141 0.820778 0.185146
H  -6.062223 1.127521 0.30991
H  0.091547 -3.543916 -2.134242
H  0.404464 -5.056443 -0.132019
