program: Gaussian 09
title: 000031021
version: EM64L-G09RevD.01
frameworkgroup: C1[X(C11H15NO)]
method: RPBEPBE
basis: SDD
operation: Freq
keyword: #p
keyword: freq=noraman
keyword: PBEPBE/SDD
title: #p freq=noraman PBEPBE/SDD
converged: YES YES NO NO
title: Mulliken charges:
elementType: O N C C C C C C C C C C C H H H H H H H H H H H H H H H
charge: -0.280881 -0.079468 -0.395784 -0.521864 -0.453075 0.103485 0.335137 0.199413 -0.426208 -0.623604 -0.389296 -0.237149 -0.533364 0.213414 0.188939 0.234744 0.207155 0.197131 0.252476 0.232208 0.224550 0.185658 0.226296 0.237817 0.220876 0.220436 0.219683 0.241277
chargesum: 0.00000
title: Mulliken charges with hydrogens summed into heavy atoms:
elementType: O N C C C C C C C C C C C
charge: -0.280881 -0.079468 0.006568 -0.079965 -0.003468 0.103485 0.335137 0.199413 -0.194000 0.012900 -0.151479 -0.016273 0.148032
polarizability: 1.56980058e+02 2.30770982e+00 1.46303626e+02 4.39724607e-01 -8.64358131e-01 7.53877210e+01
1716.lowfreq: -0.0010 -0.0009 -0.0004 2.7331 8.6060 12.3327 76.4434 78.8927 136.7301
frequency: 76.4389 78.8881 136.7238 160.3894 184.6021 210.5818 234.1492 259.4081 288.0852 295.6940 319.5251 350.8040 385.4596 468.8309 479.3532 499.5111 536.4303 564.9679 620.4374 680.2745 712.7343 763.7594 785.0355 820.7416 856.2476 872.3835 945.2850 956.8877 982.4858 986.3402 1036.3749 1060.1414 1065.8696 1082.5336 1112.2220 1115.1884 1141.7087 1150.5194 1178.2934 1188.4882 1192.9700 1204.7091 1231.1814 1248.6072 1259.2129 1289.0025 1338.0359 1344.7128 1369.9136 1398.4465 1429.2496 1433.8765 1441.7473 1454.0570 1458.2137 1462.6394 1466.4768 1470.7825 1477.2258 1481.9177 1485.9258 1598.8001 1611.3355 2808.9708 2834.7995 2852.5580 2958.6270 2980.0086 3015.0971 3016.5467 3031.4613 3036.4764 3045.9522 3074.2697 3120.4444 3121.3637 3142.4014 3166.2869
redmass: 3.1138 2.7578 2.7343 3.3963 2.4290 1.6020 1.2063 1.6268 2.4303 2.7240 2.5474 3.1096 3.9866 3.8519 2.9675 4.5113 3.8333 4.2371 3.5159 4.8562 2.2050 1.9828 2.2147 3.8515 2.2659 1.6620 3.1077 1.3368 1.7493 2.3941 2.4278 2.5208 2.5553 1.8319 1.2622 1.3498 2.1683 1.3789 1.3293 1.3535 1.3659 1.9227 2.2785 2.1132 1.7976 1.5788 1.7013 1.5906 1.6082 3.9625 1.2131 1.2456 1.1624 1.1584 2.0474 1.0915 1.0503 1.2221 1.1204 1.0793 1.7581 6.8869 7.2883 1.0716 1.0675 1.0606 1.0328 1.0601 1.0719 1.0840 1.0898 1.0992 1.1039 1.1008 1.0876 1.0982 1.0931 1.0962
irintensity: 2.1577 3.4731 3.9541 1.4344 0.8925 2.2060 0.8676 6.3428 4.0043 1.5191 2.7673 1.7547 2.6190 0.5677 0.2249 2.3228 1.4476 1.4689 4.2743 4.9656 18.2272 49.1836 16.3009 0.9264 8.0621 2.7231 28.1366 0.5738 2.4818 3.5527 60.1311 40.9468 17.2281 12.8484 0.6163 6.0729 25.0913 7.9975 1.8391 16.3302 0.1263 2.3827 52.0588 43.7254 32.4879 8.1921 7.6263 13.0816 9.8607 2.9444 10.6875 8.8361 5.2381 25.6440 72.7620 12.9566 12.4028 26.5276 7.4501 12.0954 2.5992 44.5771 25.7362 53.3055 58.0412 229.4588 72.6249 27.3976 46.7345 22.7967 44.5899 38.0641 49.6739 34.7532 4.0796 26.0378 25.7475 20.0443
temp: 298.150 k
press: 1.00000 atm
elementType: 8 7 6 6 6 6 6 6 6 6 6 6 6 1 1 1 1 1 1 1 1 1 1 1 1 1 1 1
symmnumber: 1
zpe: 622046.8 jmol-1
zpe.correction: 0.236925 hartree
zpe.thermalcorrener: 0.249098 hartree
zpe.thermalcorrenthalpy: 0.250042 hartree
zpe.thermalcorrgfe: 0.199214 hartree
zpe.sumelectzpe: -557.137121 hartree
zpe.sumelectthermal: -557.124948 hartree
zpe.sumelectthermalent: -557.124004 hartree
zpe.sumelectthermalfe: -557.174832 hartree
dipole: -1.0698 -0.4946 0.7652
dipole: 1.4052
quadrupole: -63.4853 -72.1004 -82.6725
quadrupole: 3.8686 1.6779 0.0690
quadrupole: 9.2674 0.6523 -9.9197 3.8686 1.6779 0.0690
hfenergy: -557.3740459 hartree
pointgroup: C01 [X(C11H15N1O1)]
dipole: 0.3533246 0.2607031 0.3358878 debye
polarizability: 155.3836345|3.858834|147.3984902|5.9725231|2.5134805|75.8892803 unknown
InChI: InChI=1S/C11H15NO/c1-12-7-6-9-4-3-5-11(13-2)10(9)8-12/h3-5H,6-8H2,1-2H3
charge 0 multiplicity 1
28 atoms
O  1.290034 2.08532 0.353898
N  -2.488081 0.374205 -0.343821
C  -2.680349 -0.916988 0.351619
C  -1.57486 -1.897199 -0.080472
C  -1.247317 1.055902 0.084783
C  -0.049047 0.122115 0.135472
C  -0.189122 -1.284189 0.067162
C  1.254732 0.67745 0.278128
C  0.962226 -2.113124 0.131862
C  -3.654633 1.267924 -0.253969
C  2.403276 -0.143655 0.334757
C  2.244407 -1.547547 0.259765
C  2.601151 2.723827 0.476092
H  -3.672314 -1.318857 0.074251
H  -2.668155 -0.795546 1.466928
H  -1.744075 -2.167009 -1.141221
H  -1.640377 -2.831299 0.510521
H  -1.366705 1.530284 1.096716
H  -1.035742 1.887813 -0.612498
H  0.843297 -3.201988 0.083252
H  -3.476764 2.173284 -0.862632
H  -3.88281 1.599678 0.792054
H  -4.54858 0.757516 -0.654738
H  3.404146 0.285216 0.438144
H  3.128663 -2.192909 0.308379
H  3.244067 2.493694 -0.395871
H  3.115657 2.413727 1.406479
H  2.393874 3.803753 0.50966
