program: Gaussian 09
title: 000031111
version: EM64L-G09RevD.01
frameworkgroup: C1[X(C18H24I3NO4)]
method: RPBEPBE
basis: SDD
operation: Freq
keyword: #p
keyword: freq=noraman
keyword: PBEPBE/SDD
title: #p freq=noraman PBEPBE/SDD
converged: NO YES NO NO
title: Mulliken charges:
elementType: I I I O O O O N C C C C C C C C C C C C C C C C C C H H H H H H H H H H H H H H H H H H H H H H H H
charge: 0.160457 0.149810 0.176026 -0.283205 -0.393010 -0.256914 -0.214189 -0.252271 -0.402883 -0.361326 -0.094268 -0.349162 0.646877 0.659005 -0.343774 -0.631060 -0.469597 0.189185 -0.694703 0.185415 -0.555182 -0.352286 -0.589149 -0.114743 -0.664943 -0.693417 0.218918 0.243994 0.222688 0.189589 0.246541 0.205967 0.191163 0.225107 0.260126 0.228650 0.238667 0.214418 0.220285 0.210415 0.227106 0.216056 0.277636 0.220042 0.257461 0.217208 0.209321 0.224548 0.200807 0.382597
chargesum: 0.00000
title: Mulliken charges with hydrogens summed into heavy atoms:
elementType: I I I O O O O N C C C C C C C C C C C C C C C C C C
charge: 0.160457 0.149810 0.176026 -0.283205 -0.010413 -0.256914 -0.214189 -0.252271 0.060029 0.050950 0.152273 0.047968 0.646877 0.659005 0.141458 -0.631060 -0.002279 0.189185 -0.049585 0.185415 -0.555182 0.090877 -0.589149 0.162893 0.029768 -0.058742
polarizability: 3.65425635e+02 -1.48048806e+01 2.95123193e+02 1.02948731e+01 2.90899421e+01 2.29801825e+02
1716.lowfreq: -2.4334 -0.0005 -0.0005 -0.0004 1.3323 6.5952 14.3887 18.2017 22.0603
frequency: 13.2985 18.1011 21.7972 26.3581 33.4680 35.9474 37.6102 48.2203 51.5548 60.0636 64.2036 73.7472 80.1798 87.8380 91.9696 96.1769 111.4478 124.9607 133.0777 136.4963 142.5115 163.4194 178.2015 189.9720 206.3103 224.2872 230.4114 231.5014 256.1678 257.9748 268.5598 285.7582 313.2298 321.5404 337.5827 375.0427 385.2199 424.7091 443.2551 473.7916 482.9292 512.6126 524.2187 537.1442 558.7217 585.2657 600.9305 631.1052 673.4955 680.2931 701.3264 731.0959 736.0955 741.1915 751.8254 773.7572 778.9099 822.1449 839.6573 871.2151 874.9086 878.2132 881.4571 908.9368 938.7008 952.7868 1003.1224 1019.4013 1020.5220 1046.3390 1053.4633 1064.0307 1068.3195 1076.8817 1089.9104 1094.0616 1111.9020 1125.2312 1143.3260 1153.5297 1195.1733 1215.1173 1221.7519 1228.4568 1240.2534 1250.8595 1257.4306 1284.0625 1284.9599 1289.4082 1297.3506 1298.6242 1299.3613 1315.4533 1337.4510 1348.9791 1355.8196 1360.4331 1370.4026 1374.3304 1387.1634 1389.9832 1391.8580 1400.9579 1436.9810 1446.0614 1458.1405 1466.6982 1469.1149 1471.3973 1476.0753 1477.5050 1478.4263 1480.4598 1484.3201 1487.0864 1500.4004 1526.4440 1601.0091 1665.4569 2961.1412 2966.3939 2967.4470 2969.7058 2975.2226 2991.7021 2993.6846 3006.2782 3008.4663 3010.3317 3017.2824 3026.8438 3034.2753 3043.5399 3067.6038 3070.9504 3072.9286 3073.5963 3076.0259 3076.5342 3087.0941 3113.4399 3182.6214 3507.9464
redmass: 4.2079 5.2795 5.1995 4.5445 4.4520 5.2650 6.8692 6.0796 1.7674 4.6301 1.8491 5.8280 8.0207 5.2791 4.1825 12.4664 4.3633 5.4132 3.2570 2.8571 4.7200 103.0474 4.3975 3.5138 3.2945 5.7298 1.1929 1.0837 1.8960 2.0732 4.8408 5.1647 3.7415 3.4617 6.0274 3.9572 4.6201 5.3846 4.4372 7.4604 4.5206 4.1845 3.5615 3.6207 3.2315 3.8505 3.9980 1.9833 4.6556 7.5096 4.6516 2.3423 1.4409 1.1828 4.8018 1.8142 1.5051 6.3388 1.7571 1.3905 1.4019 2.1853 3.2838 2.3857 2.0228 1.3552 4.3524 5.2435 4.1749 3.1105 2.3760 3.1299 1.6773 2.3548 1.9965 1.5645 2.0038 2.5537 2.0177 2.3787 2.0566 1.4622 1.3677 2.4408 2.7932 1.4116 1.4080 1.4438 1.2051 1.4472 1.2755 2.4427 1.3847 2.3750 1.4155 1.6151 1.5335 1.5622 1.7922 1.8863 1.2211 1.2225 1.2136 3.2528 1.1037 1.1021 1.0879 1.0686 1.0463 1.0558 1.0696 1.0430 1.0424 1.0521 1.0768 1.0816 10.5869 8.6291 8.0022 9.0045 1.0595 1.0400 1.0616 1.0569 1.0361 1.0365 1.0624 1.0627 1.0942 1.0594 1.0966 1.0864 1.0996 1.0992 1.1013 1.1038 1.1009 1.0986 1.0995 1.1024 1.0976 1.1024 1.0929 1.0640
irintensity: 0.1921 0.0256 0.2087 0.0185 0.3693 0.5524 1.6166 0.4019 0.0167 0.9819 0.1176 0.2486 0.0463 0.2764 0.1148 0.0354 0.1923 0.3322 3.5827 0.1119 0.0909 0.0120 1.3974 0.3958 0.8786 2.1499 0.1861 0.0160 1.0688 1.1129 8.7657 2.4733 1.0002 5.3279 6.6751 0.8176 2.5472 1.6974 9.7096 10.6353 7.7693 27.4168 10.0452 14.9561 11.9066 11.0813 29.9028 59.5904 14.4109 31.6139 98.1557 27.1731 2.6194 8.2758 13.4259 2.2832 7.6385 16.6652 0.2290 2.4497 14.6957 19.7483 16.4064 23.1431 2.7496 10.4733 34.4889 27.6566 45.4653 239.0320 8.1421 31.3416 17.3660 0.4273 12.3242 5.4192 22.1547 3.6775 37.4500 12.9339 66.8155 4.8432 7.9527 118.4833 12.7848 10.1626 10.8556 31.2531 26.9241 13.7996 11.7179 5.1413 40.3580 28.8561 26.6567 12.7608 1.1852 52.8204 57.6436 38.6415 34.5340 6.3813 13.1377 223.9262 26.9260 11.4197 4.5317 0.5459 9.9890 5.1014 3.2451 13.4135 11.6755 12.5708 15.6853 15.2444 7.4989 2.9811 244.4834 164.2118 3.5668 25.9418 49.5116 22.9688 38.0067 30.0834 17.3584 21.4519 6.6877 18.9231 5.2576 21.2445 27.1752 7.7251 0.4327 2.0327 92.1166 49.0398 47.4963 49.9035 34.6652 21.0506 0.2669 33.7586
temp: 298.150 k
press: 1.00000 atm
elementType: 53 53 53 8 8 8 8 7 6 6 6 6 6 6 6 6 6 6 6 6 6 6 6 6 6 6 1 1 1 1 1 1 1 1 1 1 1 1 1 1 1 1 1 1 1 1 1 1 1 1
symmnumber: 1
zpe: 1015134.4 jmol-1
zpe.correction: 0.386644 hartree
zpe.thermalcorrener: 0.418235 hartree
zpe.thermalcorrenthalpy: 0.419179 hartree
zpe.thermalcorrgfe: 0.315429 hartree
zpe.sumelectzpe: -1088.478436 hartree
zpe.sumelectthermal: -1088.446845 hartree
zpe.sumelectthermalent: -1088.445901 hartree
zpe.sumelectthermalfe: -1088.549651 hartree
dipole: -2.3212 0.2253 0.5823
dipole: 2.4037
quadrupole: -205.0293 -199.0264 -193.9099
quadrupole: 17.0222 4.4462 -0.1640
quadrupole: -5.7074 0.2954 5.4120 17.0222 4.4462 -0.1640
hfenergy: -1088.8650803 hartree
pointgroup: C01 [X(C18H24I3N1O4)]
dipole: 0.9311266 0.1589951 0.0453198 debye
polarizability: 344.0645943|28.4211178|296.8895101|47.3025239|-22.047876|249.3965485 unknown
InChI: InChI=1S/C18H24I3NO4/c1-4-7-9-13(18(24)25)26-17-12(20)10-11(19)16(15(17)21)22(6-3)14(23)8-5-2/h10,13,24H,4-9H2,1-3H3
charge 0 multiplicity 1
50 atoms
I  -0.469251 -1.284722 2.301971
I  -3.283008 2.484465 -1.749185
I  2.049239 4.089122 0.700976
O  1.647568 1.201352 2.091153
O  3.978675 0.4760 3.714678
O  -3.840417 -1.970498 -0.640333
O  4.892775 1.445213 1.811764
N  -2.773922 -0.137851 0.297311
C  2.905973 0.083541 0.158707
C  3.886273 -1.055323 -0.213268
C  2.731448 0.221038 1.67362
C  3.982469 -1.257996 -1.743361
C  -1.6796 0.786703 0.338438
C  0.559372 1.426163 1.245476
C  -3.778429 -0.121911 1.407815
C  -0.5375 0.525511 1.156656
C  -1.746843 -1.235184 -1.710805
C  -2.869184 -1.159466 -0.670121
C  4.966134 -2.380656 -2.13521
C  3.97997 0.792937 2.357935
C  -1.683952 2.004217 -0.400899
C  -1.809092 -2.52359 -2.555276
C  0.477932 2.652011 0.529098
C  -0.630273 2.937046 -0.29232
C  -5.101917 0.581351 1.053553
C  -0.676462 -2.578366 -3.601682
H  1.920796 -0.135238 -0.296963
H  3.269797 1.039712 -0.260083
H  4.893638 -0.826685 0.186525
H  3.556602 -2.004606 0.258936
H  2.484174 -0.750911 2.138684
H  4.29672 -0.305811 -2.21601
H  2.974073 -1.489341 -2.145522
H  -3.300029 0.359429 2.279467
H  -3.983018 -1.176914 1.662559
H  -0.765574 -1.163651 -1.199817
H  -1.812468 -0.348901 -2.37503
H  5.987566 -2.156019 -1.775305
H  5.015156 -2.507347 -3.231977
H  4.660301 -3.34928 -1.696663
H  -2.79545 -2.584415 -3.049684
H  -1.753049 -3.400789 -1.883809
H  -0.668478 3.8753 -0.849145
H  -4.957991 1.657075 0.856934
H  -5.557197 0.114894 0.164484
H  -5.807077 0.474346 1.899004
H  -0.736338 -1.724791 -4.303769
H  -0.73039 -3.507477 -4.197453
H  0.320367 -2.546398 -3.119526
H  4.76279 0.899008 4.160373
