program: Gaussian 09
title: 000030939
version: EM64L-G09RevD.01
frameworkgroup: C1[X(C16H10S)]
method: RPBEPBE
basis: SDD
operation: Freq
keyword: #pfreq=noraman
keyword: PBEPBE/SDD
title: #p freq=noraman PBEPBE/SDD
converged: NO NO NO NO
title: Mulliken charges:
elementType: S C C C C C C C C C C C C C C C C H H H H H H H H H H
charge: 0.245052 0.414965 0.422694 0.403766 0.404898 0.667177 -0.670061 -0.669355 -0.628563 -0.448784 -0.472141 -0.420974 -0.420932 -0.282414 -0.512654 -0.243091 -0.242866 0.245715 0.246536 0.252868 0.254283 0.240666 0.240777 0.254988 0.261289 0.228036 0.228127
chargesum: 0.00000
title: Mulliken charges with hydrogens summed into heavy atoms:
elementType: S C C C C C C C C C C C C C C C C
charge: 0.245052 0.414965 0.422694 0.403766 0.404898 0.667177 -0.424346 -0.422819 -0.375696 -0.448784 -0.217858 -0.180308 -0.180155 -0.027426 -0.251365 -0.015055 -0.014738
polarizability: 4.07597478e+02 1.28444112e+00 1.86106633e+02 -1.32979543e-02 1.23002418e-02 6.86430916e+01
1716.lowfreq: -0.0005 0.0007 0.0013 5.4286 6.5274 13.2635 60.1048 90.8854 161.6868
frequency: 60.1045 90.8778 161.6867 164.7670 193.0177 273.0759 292.3446 314.3342 324.3557 387.5079 418.4049 466.0326 472.6820 484.3042 497.0010 539.5957 549.6310 578.4638 623.0020 647.4511 673.0548 703.2427 741.5806 746.9652 749.2414 754.5530 771.2338 792.9769 809.0281 837.9698 849.3318 858.9841 884.8637 901.1674 904.4533 924.4139 944.5915 969.6800 989.4589 995.3724 1011.5108 1087.8298 1122.6881 1169.4595 1173.3218 1191.1911 1200.1688 1250.1043 1268.9077 1278.3092 1288.4621 1306.4156 1353.2872 1396.6344 1416.3611 1428.0653 1436.6808 1447.8729 1469.7472 1525.9886 1551.8556 1561.7558 1591.8325 1625.9207 1637.6528 3114.0667 3117.1620 3117.9314 3123.0933 3128.2046 3137.6167 3141.3724 3160.3939 3172.1628 3230.1364
redmass: 6.1914 4.7631 6.0652 5.5032 4.5217 8.2671 4.9646 5.8561 4.4465 3.1965 5.0038 2.8022 2.4967 4.1692 8.1567 6.8541 3.4099 7.4164 6.7990 7.3827 2.4060 6.9849 6.0639 1.8880 5.9932 1.4252 2.0170 2.0813 4.5116 3.3494 1.2819 1.3978 1.5232 1.4387 5.4895 1.5786 2.1403 1.4096 1.3493 3.9556 2.3402 1.1296 1.8902 1.2375 1.1884 1.3745 1.6350 1.8316 2.2802 1.9210 1.5546 3.1631 1.9736 3.9366 2.6053 4.4796 7.9705 4.6238 2.8173 5.7833 5.9646 7.7246 6.1691 7.1497 6.7386 1.0908 1.0916 1.0858 1.0884 1.0917 1.0922 1.0952 1.1003 1.0916 1.1001
irintensity: 0.8657 0.3476 1.3531 0.0103 0.2014 1.3170 2.9578 0.0527 0.0889 2.9978 1.1833 11.1592 19.9573 1.1903 0.2866 9.1339 0.7973 1.7899 0.5291 5.5483 26.2791 6.5222 1.4293 1.4442 6.5238 77.3738 34.0939 0.7912 12.7781 1.2653 0.2165 0.0002 0.0060 3.1138 0.7596 93.9499 8.2632 18.5219 0.0024 23.5676 7.3671 11.6687 7.5415 2.2113 0.8849 3.0252 1.9593 2.4866 7.6784 0.8674 2.2147 3.2959 0.0989 0.6256 14.5740 17.7430 6.2730 14.9923 1.4221 6.4210 3.3585 1.5685 1.7615 5.0630 2.3646 12.0332 0.7550 6.9514 0.6095 10.4022 2.5377 35.6996 50.5484 7.7149 1.8664
temp: 298.150 k
press: 1.00000 atm
elementType: 16 6 6 6 6 6 6 6 6 6 6 6 6 6 6 6 6 1 1 1 1 1 1 1 1 1 1
symmnumber: 1
zpe: 535777.3 jmol-1
zpe.correction: 0.204067 hartree
zpe.thermalcorrener: 0.216087 hartree
zpe.thermalcorrenthalpy: 0.217031 hartree
zpe.thermalcorrgfe: 0.165803 hartree
zpe.sumelectzpe: -1012.656698 hartree
zpe.sumelectthermal: -1012.644678 hartree
zpe.sumelectthermalent: -1012.643734 hartree
zpe.sumelectthermalfe: -1012.694962 hartree
dipole: -0.2811 0.9253 0.0001
dipole: 0.9670
quadrupole: -90.4748 -91.1989 -113.8842
quadrupole: 5.1000 0.0001 0.0020
quadrupole: 8.0445 7.3204 -15.3649 5.1000 0.0001 0.0020
hfenergy: -1012.8607651 hartree
pointgroup: C01 [X(C16H10S1)]
dipole: 0.0943666 -0.3685623 0.0000252 debye
polarizability: 407.277094|-8.5152415|186.4270176|0.0127405|-0.0128768|68.6430916 unknown
InChI: InChI=1S/C16H10S/c1-2-4-12-8-15-10-16-13(5-6-17-16)9-14(15)7-11(12)3-1/h1-10H
charge 0 multiplicity 1
27 atoms
S  -4.399288 1.441615 -0.000344
C  -0.284044 -0.718162 0.000196
C  -0.274289 0.750279 0.000064
C  2.193776 -0.729343 0.000236
C  2.201677 0.734561 0.000132
C  -2.745354 -0.705135 0.000112
C  0.955856 -1.411701 0.00027
C  0.970535 1.4310 0.000043
C  -1.538373 -1.412372 0.000228
C  -2.712121 0.750329 -0.000111
C  -1.523529 1.464528 -0.000101
C  3.456543 -1.428232 0.000301
C  3.471395 1.419705 0.0001
C  -4.10655 -1.221361 0.000108
C  -5.070442 -0.242197 -0.000064
C  4.659506 -0.731396 0.000263
C  4.666995 0.709834 0.000163
H  0.950568 -2.50944 0.000353
H  0.977478 2.528573 -0.000049
H  -1.543888 -2.508966 0.000369
H  -1.511668 2.560014 -0.000226
H  3.449585 -2.525077 0.000354
H  3.476425 2.516526 0.000008
H  -4.341908 -2.288685 0.000243
H  -6.152838 -0.365588 -0.000088
H  5.611373 -1.274045 0.000313
H  5.624479 1.242534 0.000127
