program: Gaussian 09
title: 000030949
version: EM64L-G09RevD.01
frameworkgroup: C1[X(C18H28N4O)]
method: RPBEPBE
basis: SDD
operation: Freq
keyword: #p
keyword: freq=noraman
keyword: PBEPBE/SDD
title: #p freq=noraman PBEPBE/SDD
converged: YES YES NO NO
title: Mulliken charges:
elementType: O N N N N C C C C C C C C C C C C C C C C C C H H H H H H H H H H H H H H H H H H H H H H H H H H H H
charge: -0.248223 -0.102338 -0.336235 -0.179746 -0.063964 -0.360586 -0.372076 -0.375822 -0.349303 -0.363909 -0.414266 -0.340059 -0.340506 -0.692994 -0.701132 0.205199 0.000284 0.332965 -0.350085 -0.361980 -0.226604 -0.227609 -0.236119 0.195093 0.185728 0.202328 0.186657 0.204004 0.254732 0.203617 0.188386 0.203538 0.211859 0.221668 0.258668 0.189475 0.192674 0.189097 0.193235 0.210371 0.215985 0.211848 0.215219 0.215250 0.213597 0.328953 0.264680 0.262796 0.229262 0.226857 0.229529
chargesum: 0.00000
title: Mulliken charges with hydrogens summed into heavy atoms:
elementType: O N N N N C C C C C C C C C C C C C C C C C C
charge: -0.248223 -0.102338 -0.007282 -0.179746 -0.063964 0.020235 0.016909 0.082914 0.042700 0.051488 0.066070 0.042089 0.041826 -0.054790 -0.057065 0.205199 0.000284 0.332965 -0.085405 -0.099183 0.002658 -0.000752 -0.006590
polarizability: 3.10596473e+02 2.70816347e+01 2.47460403e+02 7.55192493e+00 -6.02779061e+00 1.39915032e+02
1716.lowfreq: -1.7062 -0.0003 0.0004 0.0010 4.1961 8.7762 9.8262 23.2986 25.6441
frequency: 9.4095 23.2912 25.4692 34.2618 40.2765 41.3757 60.2464 68.7016 82.3375 97.0109 100.0712 106.3786 116.1773 144.2834 167.8699 189.5702 199.0876 220.3921 235.9653 238.4037 266.0880 273.7070 300.5093 322.2303 328.1728 354.8400 375.0386 403.6471 429.4947 436.5466 440.6445 477.7802 483.7055 505.6723 571.5928 614.9171 648.2068 665.5177 699.7200 714.9347 717.8967 731.8410 736.0657 785.7688 786.8232 792.1706 795.5720 800.6927 837.0420 861.7224 894.4716 898.2251 898.8442 926.8869 930.7368 937.9184 943.4313 989.3922 990.4563 1003.0505 1003.8976 1015.5276 1022.6016 1027.1892 1058.4187 1065.9661 1073.3890 1077.4970 1080.5046 1087.5272 1096.7316 1107.2587 1112.0455 1133.5083 1172.4983 1172.9621 1185.3243 1193.2731 1202.9647 1226.4999 1237.5624 1254.7036 1271.3965 1275.5326 1283.1242 1289.7162 1293.3899 1296.2358 1303.1252 1305.7520 1329.2142 1336.8528 1342.6834 1347.2926 1368.5078 1370.3636 1382.7617 1385.0431 1388.3250 1390.8015 1410.3177 1444.1562 1455.6439 1463.6105 1466.4718 1470.0165 1471.0957 1472.9809 1476.5178 1477.9980 1478.9049 1480.3789 1483.9509 1488.5243 1492.2360 1505.1276 1589.3287 1616.7293 1642.8371 2847.9363 2856.3922 2914.1321 2961.2709 2962.0709 2970.9461 2972.9162 2973.2954 2976.6307 2999.4648 3003.4505 3005.7888 3017.3554 3020.7251 3041.0606 3044.0683 3048.6471 3066.3502 3070.1964 3071.3583 3072.4241 3090.3721 3126.2176 3137.3290 3151.2811 3161.2773 3169.4961 3588.8762
redmass: 4.4194 4.3668 3.9050 4.2194 3.7181 3.5613 1.5706 2.9218 2.2133 4.0343 4.2462 3.1747 2.2590 2.6777 2.2583 2.8073 3.6297 4.1939 1.1483 1.1423 2.6452 4.1452 2.7262 6.3295 5.4227 3.3781 3.3451 2.8375 2.5850 4.9503 1.3472 3.5772 3.6737 3.0470 4.2479 6.4343 6.9902 5.6437 1.9430 4.6509 3.5851 1.0758 1.0742 2.0463 1.6918 1.2718 1.5589 2.1972 4.6339 1.2479 7.8224 1.7446 1.8076 1.2369 1.2748 5.7749 1.4307 4.4577 1.5168 1.3376 3.1819 4.1619 2.5330 3.5661 2.5327 3.7694 2.4924 1.7666 2.0452 2.2598 2.5579 2.3604 2.2435 1.8954 1.1885 1.7679 1.1340 2.0030 2.4097 1.4677 1.4580 1.3366 1.2956 1.3427 1.0832 1.2866 1.3250 1.5193 1.2255 1.2591 1.2798 1.9228 1.5272 1.5047 1.4093 1.3521 1.3713 5.8182 1.2758 1.2345 3.3780 2.2707 1.0907 1.0748 1.0700 1.0765 1.0734 1.6797 1.0465 1.0426 1.0743 1.0685 1.0859 1.0855 1.0913 3.4207 6.3736 6.0975 9.4082 1.0704 1.0703 1.0698 1.0587 1.0587 1.0404 1.0380 1.0570 1.0590 1.0891 1.0975 1.0971 1.0901 1.0603 1.1014 1.1020 1.0916 1.1000 1.1007 1.0999 1.0994 1.1069 1.0851 1.0888 1.0934 1.0958 1.1007 1.0777
irintensity: 0.0083 0.0794 0.0052 0.0862 0.1761 0.0864 0.0950 0.5891 0.7571 0.9791 2.7749 1.6425 0.2411 0.2511 0.3768 0.1319 1.9398 0.6551 0.0655 0.0170 0.3146 2.3518 0.6227 1.6996 0.8359 2.1612 2.5820 0.0623 1.5685 7.2678 126.1737 2.5120 0.2341 2.6588 11.6726 0.1597 3.3030 18.8966 35.8311 55.6246 2.4691 8.7175 9.4042 27.0991 24.6142 3.3709 7.4648 4.7403 6.9515 0.2025 8.7100 12.6563 10.2864 4.4110 2.7099 10.5444 4.4921 0.0431 0.0879 0.5685 4.3927 5.8004 19.7460 2.8188 14.8061 10.8390 4.8091 17.9196 10.8388 57.3360 13.7680 4.6076 0.9741 17.3929 5.1813 24.8598 12.1235 10.3717 9.4240 4.3890 12.6156 2.7949 3.5278 6.5878 0.2436 16.6642 13.7744 16.4225 31.3367 24.6319 2.1229 56.5078 0.3526 0.5462 13.5944 3.9688 15.5602 17.6796 7.2618 8.3241 146.6176 7.2985 17.6793 0.4652 0.3381 1.0206 1.6917 50.9790 13.0745 12.0139 7.6227 3.0466 14.3887 13.5321 11.0380 22.2121 1.9226 49.7292 548.6508 44.5384 141.2494 74.4818 25.4775 20.6707 22.6431 31.7054 58.5086 51.5100 24.1677 7.6462 3.6426 9.8801 31.1100 29.5486 50.0886 26.3380 114.2174 90.8013 53.2854 55.0298 24.0363 0.5029 13.3294 19.3718 17.2836 16.4548 91.3421
temp: 298.150 k
press: 1.00000 atm
elementType: 8 7 7 7 7 6 6 6 6 6 6 6 6 6 6 6 6 6 6 6 6 6 6 1 1 1 1 1 1 1 1 1 1 1 1 1 1 1 1 1 1 1 1 1 1 1 1 1 1 1 1
symmnumber: 1
zpe: 1142724.9 jmol-1
zpe.correction: 0.435241 hartree
zpe.thermalcorrener: 0.460142 hartree
zpe.thermalcorrenthalpy: 0.461086 hartree
zpe.thermalcorrgfe: 0.375917 hartree
zpe.sumelectzpe: -995.126966 hartree
zpe.sumelectthermal: -995.102064 hartree
zpe.sumelectthermalent: -995.101120 hartree
zpe.sumelectthermalfe: -995.186290 hartree
dipole: -3.7235 0.9224 0.4442
dipole: 3.8617
quadrupole: -133.5151 -134.6743 -144.2480
quadrupole: 17.1739 -0.9510 0.9683
quadrupole: 3.9640 2.8049 -6.7689 17.1739 -0.9510 0.9683
hfenergy: -995.5622064 hartree
pointgroup: C01 [X(C18H28N4O1)]
dipole: -1.4910533 0.2661535 0.119453 debye
polarizability: 305.9631031|30.9792627|251.2986909|14.709297|-3.2134698|140.710114 unknown
InChI: InChI=1S/C18H28N4O/c1-3-5-13-22(14-6-4-2)15-12-19-18-20-17(21-23-18)16-10-8-7-9-11-16/h7-11,19H,3-6,12-15H2,1-2H3
charge 0 multiplicity 1
51 atoms
O  1.980605 -3.206125 0.116789
N  -3.011346 -0.156789 0.302257
N  -0.318451 -2.786933 -0.299865
N  1.3453 -1.019445 -0.178262
N  3.212158 -2.370359 0.238621
C  -4.372119 -0.693367 0.548632
C  -2.802869 1.242981 0.750098
C  -1.914616 -1.07917 0.660944
C  -5.426283 -0.17367 -0.453097
C  -1.73198 1.984394 -0.079544
C  -1.46092 -1.891167 -0.580578
C  -6.83977 -0.733811 -0.173596
C  -1.451512 3.409698 0.449516
C  -7.892743 -0.225066 -1.181854
C  -0.378757 4.152027 -0.376446
C  0.935336 -2.294085 -0.131534
C  2.730985 -1.112952 0.047872
C  3.60238 0.07313 0.083139
C  4.995757 -0.048758 0.334221
C  3.037323 1.356681 -0.135834
C  5.808521 1.102189 0.365126
C  3.856195 2.505074 -0.102891
C  5.243059 2.382366 0.147591
H  -4.324099 -1.796952 0.460796
H  -4.717264 -0.477691 1.59246
H  -3.764491 1.781091 0.650172
H  -2.525818 1.289466 1.834583
H  -2.200423 -1.777894 1.480556
H  -1.042251 -0.503096 1.017367
H  -5.102594 -0.446935 -1.476576
H  -5.462019 0.934048 -0.422868
H  -2.070978 2.028511 -1.133271
H  -0.787219 1.403448 -0.078462
H  -2.292214 -2.509781 -0.962761
H  -1.177269 -1.175942 -1.371917
H  -6.807659 -1.842711 -0.200778
H  -7.148644 -0.457599 0.85568
H  -2.39268 3.997475 0.446135
H  -1.125837 3.349806 1.508409
H  -7.963731 0.878767 -1.156443
H  -8.896091 -0.633509 -0.961377
H  -7.626857 -0.518893 -2.214737
H  0.581906 3.602177 -0.358439
H  -0.19401 5.168224 0.01799
H  -0.688016 4.248896 -1.434134
H  -0.452515 -3.792709 -0.205762
H  5.425534 -1.041758 0.502473
H  1.962846 1.430706 -0.331043
H  6.882298 1.003934 0.558996
H  3.414458 3.493496 -0.273067
H  5.878583 3.274684 0.172813
