program: Gaussian 09
title: 000030937
version: EM64L-G09RevD.01
frameworkgroup: C1[X(C22H25N3)]
method: RPBEPBE
basis: SDD
operation: Freq
keyword: #pfreq=noraman
keyword: PBEPBE/SDD
title: #p freq=noraman PBEPBE/SDD
converged: YES YES NO NO
title: Mulliken charges:
elementType: N N N C C C C C C C C C C C C C C C C C C C C C C H H H H H H H H H H H H H H H H H H H H H H H H H
charge: -0.297396 -0.700296 -0.699060 -0.366629 -0.448084 -0.391836 0.479868 0.558808 -0.389475 -0.467106 -0.421894 -0.388955 -0.478890 -0.429075 -0.426343 -0.446942 -0.421359 0.494074 0.488538 0.421692 -0.388154 -0.437888 -0.224690 -0.224180 -0.244940 0.206511 0.224935 0.187912 0.197181 0.215123 0.246225 0.230749 0.225381 0.242859 0.237455 0.221119 0.194286 0.210690 0.211592 0.210220 0.210807 0.273598 0.230907 0.300889 0.300717 0.301310 0.300508 0.222297 0.222176 0.224769
chargesum: 0.00000
title: Mulliken charges with hydrogens summed into heavy atoms:
elementType: N N N C C C C C C C C C C C C C C C C C C C C C C
charge: -0.051171 -0.098691 -0.097242 -0.160118 -0.035237 0.020467 0.479868 0.558808 -0.158726 -0.241726 -0.179035 -0.151500 -0.063485 -0.218386 -0.214751 -0.236721 -0.210552 0.494074 0.488538 0.421692 -0.114556 -0.206982 -0.002394 -0.002004 -0.020171
polarizability: 2.95026229e+02 1.43821933e+01 3.06609574e+02 -8.41387098e+00 1.95052365e+01 1.82751922e+02
1716.lowfreq: -5.4088 -0.0005 0.0003 0.0004 3.4220 5.8341 15.5340 17.3829 24.7672
frequency: 15.3980 17.2849 24.7370 29.6333 34.9315 41.9456 49.6454 87.3552 103.0039 115.6483 139.5845 149.4811 169.6298 198.8097 211.8996 250.2286 260.2910 306.0220 313.2283 318.7715 334.3285 356.0063 358.7318 363.6402 376.0495 387.6533 403.3624 407.4864 408.1694 412.1231 469.1879 497.4713 507.8096 527.7299 561.9904 582.5193 597.4481 616.8365 637.1430 641.4017 690.9182 702.9025 710.3897 730.2532 745.0788 748.8476 794.2503 810.1359 811.2004 816.4267 817.5698 822.3286 826.4912 847.3068 852.9863 859.1637 914.3115 939.5353 941.0173 955.7675 956.0809 968.2802 981.7781 989.4694 996.3588 998.2332 1001.9489 1010.4235 1012.4421 1022.0476 1024.3502 1026.4712 1076.7867 1078.3187 1096.5385 1126.6770 1135.2134 1137.7878 1163.1742 1168.9635 1179.6922 1184.7926 1192.0871 1198.3803 1205.3272 1211.9903 1231.0728 1249.7680 1271.3979 1291.3430 1301.5238 1309.1233 1311.4074 1313.9587 1326.4425 1329.1067 1344.7131 1376.8732 1380.9857 1385.5387 1392.5715 1431.9907 1432.9286 1439.7797 1450.1244 1464.3913 1475.0576 1483.9721 1496.5388 1513.7755 1519.2456 1579.6485 1582.3394 1593.4425 1614.7970 1629.7328 1631.6102 1641.5783 1643.9207 2855.2071 2890.9620 2946.6093 2963.9441 2965.7032 2982.1317 3041.1439 3101.8488 3107.0750 3108.4569 3111.4012 3111.9159 3121.8467 3126.3748 3131.3929 3135.2533 3135.5341 3149.5567 3150.1896 3161.5971 3423.9123 3569.0128 3569.4848 3709.7602 3710.1886
redmass: 4.6503 3.6636 3.8038 4.4789 4.5009 4.0982 4.1155 4.1476 3.9082 2.0789 4.1890 4.3029 4.1487 3.6375 3.5034 4.0365 3.2595 1.6684 1.2350 2.3178 4.8723 1.0464 1.0464 3.6726 3.2889 3.0565 3.1964 2.8552 2.7402 3.0512 3.0931 3.5313 3.4613 3.2917 2.5620 3.5462 4.7819 6.2866 6.8150 6.5173 1.6500 2.5611 1.6726 3.0502 2.3334 1.7962 3.0674 3.3336 1.6221 1.3233 1.3882 3.1346 2.3663 1.7781 3.4686 1.2493 1.3438 1.3786 1.4132 1.3606 1.3628 1.8921 1.3803 6.1406 1.5817 2.4816 2.6873 1.7584 1.5690 1.8929 1.9314 2.1347 2.8441 1.6190 2.0059 1.2618 1.3211 3.9851 1.1508 1.0601 1.1105 1.1801 1.3161 1.7362 2.0867 2.3585 1.3252 1.4355 1.3510 1.3238 1.2963 2.8372 2.8256 1.4055 1.3048 1.2797 1.4456 2.7360 4.3563 4.8649 2.3098 3.4098 3.2007 2.1347 1.2067 1.0852 1.3559 1.6486 1.0924 2.9992 2.9543 6.6839 6.5917 6.1745 6.1489 2.0542 1.7139 1.8844 2.2808 1.0712 1.0673 1.0798 1.0681 1.0857 1.0864 1.0997 1.0866 1.0866 1.0868 1.0866 1.0884 1.0866 1.0958 1.0962 1.0965 1.0924 1.0939 1.0952 1.1007 1.0742 1.0447 1.0447 1.1040 1.1040
irintensity: 0.0514 0.0920 0.0974 0.1872 0.8081 0.2042 1.1493 0.3039 4.8605 3.4298 1.1100 3.6281 0.4692 4.6863 0.2382 2.3212 1.2200 154.3254 281.1575 163.8798 20.9995 0.4315 0.4197 3.5320 4.1830 0.9280 0.3233 0.1617 0.4058 0.1651 8.8747 5.5279 9.4789 12.1554 31.6040 12.3414 1.9483 0.5095 0.1241 0.1304 52.4879 11.5157 63.6932 0.3969 13.9849 55.8163 17.5729 1.5068 32.2519 4.7135 7.2079 31.2578 51.7294 9.1348 15.1771 0.0643 4.6235 0.3876 0.1770 0.2596 0.2134 9.8292 0.1568 0.0191 1.6423 2.6250 2.3998 0.6278 2.8154 12.6085 9.2479 6.4568 1.8102 8.1077 2.5417 11.3125 26.0435 65.4212 6.7867 0.4100 1.3501 27.9307 30.1037 3.4312 1.3273 2.5034 6.9534 8.4418 2.1803 5.2658 7.3118 73.9314 66.1974 8.1698 1.4385 0.9453 25.8640 9.6351 13.6700 10.3348 2.9356 1.5623 0.2830 9.1263 47.7748 5.4350 27.2213 3.6374 3.9454 191.3445 103.5716 4.9350 7.2092 0.8391 9.5658 0.1415 4.8539 374.5894 200.9706 74.5342 87.0355 11.4991 22.0697 23.7523 41.8722 55.3812 17.8833 15.1650 25.9488 8.3217 35.0875 0.9229 41.7904 32.1418 5.0267 30.5338 12.6853 29.4858 23.9475 0.6991 84.8467 56.5411 18.4346 18.3904
temp: 298.150 k
press: 1.00000 atm
elementType: 7 7 7 6 6 6 6 6 6 6 6 6 6 6 6 6 6 6 6 6 6 6 6 6 6 1 1 1 1 1 1 1 1 1 1 1 1 1 1 1 1 1 1 1 1 1 1 1 1 1
symmnumber: 1
zpe: 1097491.9 jmol-1
zpe.correction: 0.418013 hartree
zpe.thermalcorrener: 0.442001 hartree
zpe.thermalcorrenthalpy: 0.442945 hartree
zpe.thermalcorrgfe: 0.360515 hartree
zpe.sumelectzpe: -1015.796397 hartree
zpe.sumelectthermal: -1015.772409 hartree
zpe.sumelectthermalent: -1015.771464 hartree
zpe.sumelectthermalfe: -1015.853895 hartree
dipole: -2.8737 1.7272 -1.2843
dipole: 3.5904
quadrupole: -131.9266 -116.3192 -143.6115
quadrupole: 7.4357 1.4395 4.4364
quadrupole: -1.3075 14.2999 -12.9924 7.4357 1.4395 4.4364
hfenergy: -1016.2144092 hartree
pointgroup: C01 [X(C22H25N3)]
dipole: 1.1431063 0.6631669 0.4988956 debye
polarizability: 294.514239|-14.3223524|307.0385512|-9.3659692|-19.218959|182.8349334 unknown
InChI: InChI=1S/C22H25N3/c23-20-10-6-18(7-11-20)22(19-8-12-21(24)13-9-19)14-15-25-16-17-4-2-1-3-5-17/h1-13,22,25H,14-16,23-24H2
charge 0 multiplicity 1
50 atoms
N  -2.427033 -0.263035 -0.245737
N  5.783423 -3.83895 0.530125
N  2.639455 5.201179 0.919812
C  1.418269 -0.220955 -0.782493
C  0.023184 -0.661269 -0.253802
C  -1.133777 0.1888 -0.809184
C  2.54068 -1.207421 -0.412115
C  1.762246 1.211222 -0.341388
C  3.827494 -1.03992 -0.99078
C  1.715909 2.296507 -1.25055
C  2.376956 -2.283136 0.495584
C  2.117468 1.498187 1.002406
C  -3.60336 0.484108 -0.740212
C  4.898631 -1.899905 -0.690885
C  2.004708 3.617252 -0.84751
C  3.441076 -3.15404 0.814545
C  2.403546 2.809384 1.425962
C  4.722878 -2.979154 0.224241
C  2.351601 3.896499 0.504461
C  -4.913601 -0.086832 -0.207733
C  -5.079003 -1.486537 -0.045888
C  -5.996998 0.770432 0.108564
C  -6.305233 -2.015698 0.414249
C  -7.227306 0.242852 0.564266
C  -7.385699 -1.153742 0.718497
H  1.346127 -0.205769 -1.891838
H  -0.164821 -1.717858 -0.523665
H  0.017527 -0.601284 0.855224
H  -1.182891 0.067099 -1.911266
H  -0.932297 1.269556 -0.613619
H  -2.402084 -0.276385 0.784412
H  3.993045 -0.206013 -1.684813
H  1.449461 2.106929 -2.298871
H  1.40541 -2.461098 0.968521
H  2.189892 0.675131 1.724236
H  -3.591965 0.407379 -1.848178
H  -3.560898 1.578457 -0.508804
H  5.877951 -1.740668 -1.160146
H  1.96359 4.435323 -1.577923
H  3.278078 -3.97779 1.521355
H  2.679262 2.999862 2.471233
H  -4.231599 -2.139985 -0.279306
H  -5.877106 1.855964 -0.000987
H  5.658056 -4.609982 1.178596
H  6.697465 -3.70728 0.108404
H  2.89788 5.395089 1.882286
H  2.613702 5.974419 0.262461
H  -6.420198 -3.099375 0.534643
H  -8.05601 0.919102 0.804243
H  -8.337091 -1.564853 1.075168
