program: Gaussian 09
title: 000030900
version: EM64L-G09RevD.01
frameworkgroup: C1[X(C9H9Cl2NOS)]
method: RPBEPBE
basis: SDD
operation: Freq
keyword: #p
keyword: freq=noraman
keyword: PBEPBE/SDD
title: #p freq=noraman PBEPBE/SDD
converged: YES YES NO NO
title: Mulliken charges:
elementType: Cl Cl S O N C C C C C C C C C H H H H H H H H H
charge: -0.067481 -0.055798 0.128619 -0.207446 -0.324145 -0.337485 -0.152573 -0.551269 -0.152294 -0.239628 0.007606 -0.212590 -0.196571 -0.093618 0.253751 0.264013 0.335517 0.283089 0.272187 0.271431 0.256813 0.258846 0.259026
chargesum: 0.00000
title: Mulliken charges with hydrogens summed into heavy atoms:
elementType: Cl Cl S O N C C C C C C C C C
charge: -0.067481 -0.055798 0.128619 -0.207446 0.011371 0.180280 -0.152573 0.004007 0.119138 0.017185 0.007606 0.046256 0.062455 -0.093618
polarizability: 2.29163505e+02 6.89683984e+00 1.28638711e+02 -1.98973459e+01 1.74958697e+00 8.27050631e+01
1716.lowfreq: -9.3026 -5.1759 -0.6446 -0.0034 -0.0028 -0.0021 16.9281 31.6828 41.8248
frequency: 14.3197 31.5641 41.7352 51.3619 70.4683 95.6534 124.6543 190.0392 217.0417 232.9353 285.8549 316.7251 328.9226 368.8992 408.4288 434.9720 450.3441 489.8157 521.3141 593.1649 603.3720 619.2676 628.1833 696.3072 715.3602 758.2954 817.1296 821.6044 841.6495 943.4196 958.3633 981.8863 990.3847 1005.5482 1067.6502 1070.8911 1084.6492 1104.2605 1152.7053 1182.4744 1188.5522 1233.9334 1286.5430 1297.1642 1361.4290 1364.5483 1380.8328 1440.2960 1448.9029 1456.3482 1477.8309 1575.9049 1579.7873 1666.8044 3004.5695 3061.9530 3072.1177 3153.1906 3155.8802 3165.8439 3175.8879 3188.8004 3531.7209
redmass: 15.3603 4.4693 8.4977 7.9805 9.7246 3.8156 7.8688 10.0644 8.4040 4.8656 5.9179 4.8726 4.4395 4.9831 2.9078 8.6813 2.8481 3.8577 7.1007 2.5160 2.9449 7.0139 2.4386 3.9114 7.2683 3.7644 1.3343 1.3622 2.1787 1.3367 1.3699 2.3868 5.1064 1.7243 7.0140 1.9111 3.2661 1.3649 1.4573 1.1612 1.8533 1.2208 1.2359 1.1698 4.6682 1.3183 3.9937 1.1015 1.0953 2.1045 1.6248 6.2951 7.8751 9.4700 1.0603 1.0755 1.0830 1.0892 1.1120 1.0898 1.0970 1.0970 1.0778
irintensity: 0.0062 0.7674 2.8139 4.7691 5.1489 2.7894 1.9429 0.2599 1.7100 13.0693 0.4415 5.7409 15.7336 14.6311 0.2698 12.2803 8.7746 26.2212 21.1336 50.2477 88.8045 1.2366 27.4292 0.5368 5.3409 32.7747 27.1333 50.7001 55.4941 0.5702 0.6616 82.3179 67.5041 17.3336 5.8937 62.0026 5.3545 7.8988 93.0717 20.3651 128.5167 112.3374 1.2184 32.2712 1.3364 4.9643 9.5133 7.4956 51.3037 139.0631 263.6862 14.3292 2.1576 165.6938 41.2355 5.5958 16.4475 1.7934 12.7798 1.4322 3.5577 0.6756 56.4587
temp: 298.150 k
press: 1.00000 atm
elementType: 17 17 16 8 7 6 6 6 6 6 6 6 6 6 1 1 1 1 1 1 1 1 1
symmnumber: 1
zpe: 428146.2 jmol-1
zpe.correction: 0.163072 hartree
zpe.thermalcorrener: 0.177672 hartree
zpe.thermalcorrenthalpy: 0.178616 hartree
zpe.thermalcorrgfe: 0.117235 hartree
zpe.sumelectzpe: -1795.496207 hartree
zpe.sumelectthermal: -1795.481608 hartree
zpe.sumelectthermalent: -1795.480664 hartree
zpe.sumelectthermalfe: -1795.542044 hartree
dipole: -2.9993 0.4492 -0.0475
dipole: 3.0331
quadrupole: -107.5794 -98.4512 -103.5565
quadrupole: -10.7587 1.3616 2.5344
quadrupole: -4.3837 4.7445 -0.3608 -10.7587 1.3616 2.5344
hfenergy: -1795.6592797 hartree
pointgroup: C01 [X(C9H9Cl2N1O1S1)]
dipole: -1.1848089 0.0926103 -0.1078691 debye
dipolederiv: -0.3727571 -0.1195939 0.0781606 -0.160948 -0.2873533 0.061691 0.1696238 0.1397891 -0.3519139 -0.8531331 0.0793355 0.2407803 0.0829374 -0.1248193 -0.0048645 0.2977022 -0.0071363 -0.1741274 -0.6668812 0.0815186 -0.1737482 0.2485739 -0.1579399 0.0446512 -0.5232238 0.1120623 -0.3030899 -0.8074121 -0.028334 0.0609007 -0.0303172 -0.3576503 0.2397487 -0.1059325 0.2477227 -0.9655574 -1.8127717 -0.0331906 -0.136919 -0.0365559 -0.4601834 -0.0865652 -0.2669448 -0.0767437 -0.3705951 0.444577 -0.1008696 0.1488607 -0.2402397 0.1835771 0.0488228 0.6309368 0.1015411 0.1577062 0.728483 -0.1144531 -0.1247017 -0.0193421 -0.01171 0.0397186 -0.2746462 0.0193893 -0.1185437 0.3471006 0.150328 -0.2168342 0.2607843 0.2662683 -0.1926535 -0.3516275 -0.1847903 0.4362761 -0.0822807 -0.0934367 0.0353838 0.0796008 0.0017974 -0.0419409 0.1315004 -0.0589752 -0.066276 -0.190423 0.074112 -0.0689008 -0.1056497 0.0180497 -0.0338862 0.0256204 -0.0803159 -0.0523686 2.2446214 0.0332394 0.2148708 -0.1772504 0.30957 -0.3254383 0.5898382 -0.3550087 1.1958054 -0.3255112 0.1010363 0.0117472 0.0591562 -0.0381568 -0.0489414 0.0566458 -0.0897694 -0.0760917 -0.3096835 -0.0711859 0.1004773 -0.0308452 -0.0181879 -0.0263011 0.0801351 -0.0110809 -0.1327921 1.1713599 -0.127974 -0.416338 -0.1416967 0.1198643 -0.0424767 -0.458668 -0.0312139 0.1375626 -0.1240865 0.0986019 -0.0213957 0.1176527 -0.0083863 -0.0417947 -0.0685586 -0.1024563 0.0503482 0.1439391 -0.0735249 0.107757 -0.0393717 0.0848921 0.0477732 -0.0585798 0.0072823 0.0372336 0.2790979 0.0188266 -0.0249265 0.0892453 0.3093161 0.1024704 -0.0717874 0.0817977 0.1721556 0.0301259 0.053379 0.1001526 0.0119601 -0.0306337 -0.0059841 0.1013774 -0.0016192 0.0082335 -0.0951758 -0.0067173 -0.0568743 -0.0360696 0.069316 0.0772265 -0.0547118 0.0573856 -0.0440912 0.0829679 0.082083 0.0095894 0.0692938 0.0407326 0.0169542 0.011464 0.0354037 0.1123558 0.0792211 -0.0508147 0.0718102 -0.0441152 0.0322025 0.0565164 0.061944 0.0752608 0.097232 0.0496633 -0.0319963 0.053265 -0.0341405 0.0419798 0.0717484 0.0580496 0.0796966 0.1074536 0.038959 0.0796307 0.006883 0.0773373 0.0174552 0.0435252 0.0198427 0.0417786 0.1430845 unknown
polarizability: 228.1214257|-9.7156001|104.715768|-21.9176725|-22.9111574|107.6700848 unknown
InChI: InChI=1S/C9H9Cl2NOS/c10-5-6-12-9(13)14-8-3-1-7(11)2-4-8/h1-4,12H,5-6H2
charge 0 multiplicity 1
23 atoms
Cl -5.665418 -1.137776 0.421648
Cl 5.479744 -0.411498 -0.881685
S  -0.482287 0.169769 1.527657
O  -1.067332 1.006871 -1.085522
N  -2.87114 0.44252 0.294502
C  -3.925857 0.784486 -0.670629
C  1.186571 0.017278 0.773546
C  -4.755139 -0.429998 -1.087895
C  1.754291 1.069507 0.018929
C  1.920521 -1.165784 1.022826
C  -1.535455 0.601435 0.00339
C  3.062766 0.93551 -0.49699
C  3.237105 -1.298892 0.526129
C  3.784268 -0.244171 -0.229768
H  -4.587128 1.564737 -0.249476
H  -3.427092 1.201319 -1.564981
H  -3.15593 0.01671 1.180532
H  -4.135592 -1.254309 -1.468421
H  -5.546256 -0.159497 -1.802464
H  1.182534 1.979075 -0.178183
H  1.470239 -1.981932 1.596211
H  3.509488 1.739062 -1.088969
H  3.814901 -2.207522 0.716913
