program: Gaussian 09
title: 000030873
version: EM64L-G09RevD.01
frameworkgroup: C1[X(C6H12O2)]
method: RPBEPBE
basis: SDD
operation: Freq
keyword: #pfreq=noraman
keyword: PBEPBE/SDD
title: #p freq=noraman PBEPBE/SDD
converged: YES YES NO NO
title: Mulliken charges:
elementType: O O C C C C C C H H H H H H H H H H H H
charge: -0.269058 -0.264244 -0.027334 -0.157684 -0.166396 -0.733309 -0.510627 -0.503931 0.166129 0.259934 0.211020 0.230254 0.222259 0.227015 0.233678 0.193668 0.221579 0.192342 0.244250 0.230456
chargesum: 0.00000
title: Mulliken charges with hydrogens summed into heavy atoms:
elementType: O O C C C C C C
charge: -0.269058 -0.264244 0.138795 0.102250 0.044624 -0.053781 0.138298 0.163117
polarizability: 9.74690995e+01 -8.63371340e-01 6.78886110e+01 -4.88721393e+00 1.55761237e+00 6.00484835e+01
1716.lowfreq: -13.7070 -8.1293 0.0006 0.0008 0.0010 6.7360 67.6520 87.9196 105.4064
frequency: 67.6363 87.8792 105.4032 135.4788 156.6602 177.8024 196.0851 227.4348 275.8456 299.1870 381.1505 431.1299 518.0917 540.2441 777.1103 866.3149 912.4571 934.0866 978.0893 1003.1873 1045.5244 1051.2812 1104.0845 1109.1675 1114.5131 1134.5342 1148.0782 1175.5001 1247.9134 1286.5641 1307.7280 1347.7504 1393.8732 1425.2193 1431.2787 1453.5864 1455.0189 1461.9062 1469.7372 1478.6118 1480.2696 1689.7366 2853.6285 2927.9111 2948.9290 2968.5715 3009.4800 3042.5123 3060.7401 3066.4848 3092.1348 3103.9092 3119.9393 3130.8778
redmass: 2.7681 2.3136 2.1058 1.5617 1.2527 1.3392 1.4312 1.9710 3.4957 2.9602 3.9648 3.2686 5.2387 2.7893 2.0142 4.0047 3.5973 1.6553 1.0996 10.0385 1.5541 4.7295 2.2289 1.2758 1.3167 1.7419 1.5435 1.9305 1.2950 1.2754 1.1358 1.4478 1.2350 1.1534 1.1358 1.0529 1.0523 1.0472 1.0588 1.0528 1.0527 6.2130 1.0836 1.0364 1.0396 1.0369 1.0993 1.0969 1.0920 1.0908 1.0985 1.0976 1.1029 1.0911
irintensity: 0.9651 5.8673 6.9786 1.4578 1.4026 4.2871 3.0806 8.2179 3.2528 1.1861 3.2147 7.0033 2.3274 8.4565 35.2929 73.5475 18.5776 23.8931 79.7620 127.5151 0.6167 94.6934 34.0464 1.8443 2.7585 39.0469 18.2986 3.6909 1.4616 5.5788 15.9341 37.8153 10.6606 5.5544 4.5533 12.4934 6.4279 14.9704 24.3173 10.4334 14.4064 19.9900 74.3385 71.9513 79.6268 31.6029 63.7923 25.5069 46.8045 7.7834 42.0055 29.3570 25.6783 11.5352
temp: 298.150 k
press: 1.00000 atm
elementType: 8 8 6 6 6 6 6 6 1 1 1 1 1 1 1 1 1 1 1 1
symmnumber: 1
zpe: 443864.0 jmol-1
zpe.correction: 0.169059 hartree
zpe.thermalcorrener: 0.179662 hartree
zpe.thermalcorrenthalpy: 0.180606 hartree
zpe.thermalcorrgfe: 0.133067 hartree
zpe.sumelectzpe: -385.560568 hartree
zpe.sumelectthermal: -385.549964 hartree
zpe.sumelectthermalent: -385.549020 hartree
zpe.sumelectthermalfe: -385.596560 hartree
dipole: -0.8380 1.3571 2.1455
dipole: 2.6734
quadrupole: -42.7177 -49.4323 -49.3862
quadrupole: -0.8422 2.6411 0.9592
quadrupole: 4.4611 -2.2536 -2.2074 -0.8422 2.6411 0.9592
hfenergy: -385.7296264 hartree
pointgroup: C01 [X(C6H12O2)]
dipole: -0.362078 0.4667655 0.8702337 debye
dipolederiv: -0.6780829 -0.107554 -0.0095529 -0.0172083 -1.1514241 -0.0579761 -0.0489293 0.0650364 -0.4174961 -1.1087928 0.2864464 -0.0251083 0.3225842 -0.7016845 0.0325439 -0.0012056 -0.0024645 -0.3983564 1.1639417 0.0208913 -0.0381425 -0.3470971 1.2971662 -0.0543214 0.0100652 -0.1447088 0.5491452 -0.2863979 0.0280688 -0.0114623 0.0310245 -0.3095235 0.0778879 -0.0218828 0.0842006 0.068327 0.2982719 0.044066 0.0083209 0.0990526 -0.2182028 0.0614647 0.0243506 0.0794449 0.1171287 -0.1926015 -0.0465186 -0.0426834 -0.0332996 0.1180927 -0.0125854 0.024562 -0.009384 0.0411466 0.2569609 -0.181097 0.0183189 0.0364589 0.543788 0.0751121 0.0738494 0.214594 0.3342776 0.6297939 -0.1370177 0.0547827 0.0074079 0.2424675 -0.0322436 0.1830378 -0.1044879 0.3329432 -0.0332533 -0.0182262 -0.0020225 0.0445736 -0.0656387 -0.0396856 0.026799 0.0073722 -0.2597539 0.0664586 -0.0166463 -0.0166441 -0.0341734 0.1644681 -0.0445043 -0.0403142 -0.0612027 -0.0586616 0.0296614 -0.0216879 -0.0681741 -0.0211215 0.1330573 -0.068234 -0.0554478 -0.0661841 -0.1339543 0.0694658 0.006267 0.0417013 -0.0144713 0.0961627 -0.0489281 -0.0546659 -0.0582435 -0.1361238 -0.0506911 0.0813667 0.0113454 0.1462112 -0.0555916 -0.0333936 -0.02754 -0.0568152 0.1045598 -0.0143297 -0.0787019 0.038062 -0.1400041 -0.0326014 0.0903701 0.0168477 0.1036669 0.0457232 0.0474302 -0.1001231 0.0445005 -0.0702414 -0.1118838 0.055858 0.0525857 0.0684165 0.0722841 0.056413 0.0484048 -0.039811 0.0174664 0.0117778 0.0374758 -0.0645173 -0.1043448 -0.2257585 -0.171305 0.1348315 -0.0249665 0.0332474 0.0397574 -0.0157767 -0.0286259 -0.0493247 0.0485079 -0.0165198 0.015207 0.0330819 -0.0306694 0.0919029 -0.0252729 -0.0982697 0.029962 -0.2240133 -0.0459877 -0.0540654 0.0098016 -0.1689963 -0.026157 0.0636398 0.0044348 0.0742193 0.0523921 -0.0204358 0.0960886 0.0186522 0.1392556 -0.0659333 -0.0614305 0.0248662 -0.0697526 0.0876824 unknown
polarizability: 97.6744952|0.2714914|67.6396927|-4.1790528|1.9315103|60.0920061 unknown
InChI: InChI=1S/C6H12O2/c1-4-5-6(7-2)8-3/h4-6H,1-3H3
charge 0 multiplicity 1
20 atoms
O  1.038137 1.155337 -0.405748
O  1.366395 -1.169219 -0.308383
C  0.494122 -0.121446 0.135703
C  -0.880741 -0.399412 -0.407194
C  -2.010546 -0.320273 0.341594
C  -3.412275 -0.549869 -0.172723
C  0.490385 2.333928 0.265623
C  2.738378 -1.055045 0.21052
H  0.489873 -0.0385 1.253675
H  -0.914302 -0.637951 -1.477736
H  -1.91858 -0.08385 1.414395
H  -3.414287 -0.780397 -1.252019
H  -4.050288 0.340269 -0.007679
H  -3.896257 -1.391238 0.360465
H  1.000189 3.202214 -0.180688
H  0.690992 2.311206 1.359266
H  -0.602937 2.426124 0.104812
H  2.741422 -1.031667 1.321055
H  3.229944 -0.146759 -0.178556
H  3.263278 -1.956352 -0.141082
