program: Orca
programVersion: 4.2.1
elementType: Cl O N N N C C C C C C C C C C C C C C C C C H H H H H H H H H H H H H H H H H H H H
charge: 0
multiplicity: 1
keywords: wb97x-d3
keywords: def2-TZVPP
keywords: def2/J RIJCOSX GRIDX6 NOFINALGRIDX
keywords: grid4 nofinalgrid
keywords: scfconv7
keywords: smallprint printgap noloewdin
keywords: NOSOSCF
formula: C17H20ClN3O
InChI: InChI=1S/C17H20ClN3O/c1-16(2)8-7-14(9-13-3-5-15(18)6-4-13)17(16,22)10-21-12-19-11-20-21/h3-6,9,11-12,22H,7-8,10H2,1-2H3
42 atoms
Cl 5.923205 0.086031 -0.318903
O  -2.682908 0.081831 1.674573
N  -2.138454 -1.769125 -0.47743
N  -2.322459 -2.662826 0.495358
N  -0.61841 -3.281466 -0.819355
C  -3.13953 1.902005 0.039443
C  -2.42863 0.557734 0.382275
C  -2.336431 2.381092 -1.175613
C  -0.965178 0.862472 0.101518
C  -0.880888 2.016006 -0.861159
C  -2.915745 -0.559259 -0.565929
C  -2.951375 2.88181 1.201382
C  -4.629004 1.772808 -0.250779
C  0.015207 0.134617 0.64564
C  1.456838 0.201019 0.412656
C  -1.115801 -2.1475 -1.24912
C  2.220115 -0.923891 0.745148
C  2.129405 1.29958 -0.130974
C  -1.392809 -3.550745 0.250418
C  3.585128 -0.971796 0.524396
C  3.496836 1.270493 -0.350701
C  4.216487 0.130775 -0.029637
H  -2.465193 3.449831 -1.353878
H  -2.673052 1.874494 -2.084016
H  -0.374989 2.866104 -0.396347
H  -0.304906 1.770803 -1.757385
H  -2.87923 -0.228861 -1.60257
H  -3.951167 -0.813788 -0.340481
H  -3.308642 3.872197 0.913809
H  -3.522304 2.583199 2.082475
H  -1.907943 2.995454 1.506181
H  -4.840226 1.177163 -1.140311
H  -5.164847 1.324706 0.588868
H  -5.065319 2.759097 -0.422075
H  -2.225895 0.644023 2.309892
H  -0.2824 -0.664802 1.319342
H  -0.780145 -1.578722 -2.102122
H  1.732913 -1.789868 1.17646
H  1.600437 2.207871 -0.376274
H  -1.271644 -4.431756 0.861885
H  4.146668 -1.85974 0.781742
H  3.99324 2.135975 -0.768507
elementType: Cl O N C H
totalener: -1359.62661607 hartree
nucrepener: 1953.55817830 hartree
electener: -3313.18479438 hartree
oneelecener: -5738.11334001 hartree
twoeener: 2424.92854563 hartree
cpcmener: -0.03128618 hartree
kineticenergy: 1354.98563081 hartree
xcener: -109.836000878765 hartree
chargesum: -0.0000000
charge: -0.100021 -0.392602 0.125672 -0.342903 -0.404006 0.231882 0.538366 -0.248635 -0.304740 -0.130467 -0.193370 -0.376633 -0.334758 -0.098667 0.068860 0.052955 -0.174448 -0.239659 0.050368 -0.186604 -0.161667 0.126227 0.083768 0.086298 0.107012 0.109884 0.141318 0.124946 0.097732 0.098832 0.110013 0.089385 0.102669 0.103360 0.221141 0.112456 0.167976 0.133186 0.163587 0.159059 0.142394 0.139835
qa: -0.1000 -0.3926 0.1257 -0.3429 -0.4040 0.2319 0.5384 -0.2486 -0.3047 -0.1305 -0.1934 -0.3766 -0.3348 -0.0987 0.0689 0.0530 -0.1744 -0.2397 0.0504 -0.1866 -0.1617 0.1262 0.0838 0.0863 0.1070 0.1099 0.1413 0.1249 0.0977 0.0988 0.1100 0.0894 0.1027 0.1034 0.2211 0.1125 0.1680 0.1332 0.1636 0.1591 0.1424 0.1398
va: 1.2065 2.0529 3.3626 2.8914 3.0133 3.7617 3.6766 4.0058 3.6607 3.8881 3.9060 3.9461 3.9013 3.7726 3.6048 4.0653 3.9935 3.9912 4.0459 4.0327 4.0249 3.8071 1.0162 1.0136 0.9969 1.0047 0.9928 1.0136 1.0061 1.0096 0.9935 1.0016 1.0092 1.0030 1.0141 1.0436 0.9946 1.0141 0.9939 0.9968 1.0074 1.0098
dispcorr: -0.024060260 hartree
energy: -1359.650676334486
dipole: -35.65123 34.42262 -1.22861 16.90005 -14.46834 2.43170 -0.28957 -0.39617 -0.68574
magnitude: 2.80943 au
magnitude: 7.14100 debye
