program: Gaussian 09
title: 000030922
version: EM64L-G09RevD.01
frameworkgroup: C1[X(C16H23NO2)]
method: RPBEPBE
basis: SDD
operation: Freq
keyword: #p
keyword: freq=noraman
keyword: PBEPBE/SDD
title: #p freq=noraman PBEPBE/SDD
converged: YES YES NO NO
title: Mulliken charges:
elementType: O O N C C C C C C C C C C C C C C C C H H H H H H H H H H H H H H H H H H H H H H H
charge: -0.316089 -0.184629 -0.291703 0.178242 0.170283 0.213116 0.257226 -0.459720 0.158029 -0.389126 -0.700934 -0.710841 -0.387221 -0.421595 -0.368444 -0.252573 -0.795176 -0.233186 -0.626344 0.192265 0.224787 0.267135 0.173999 0.227664 0.272087 0.191685 0.237466 0.198849 0.228430 0.230026 0.244367 0.167653 0.211919 0.228043 0.247524 0.244631 0.258181 0.228446 0.251399 0.225712 0.186494 0.221924
chargesum: 0.00000
title: Mulliken charges with hydrogens summed into heavy atoms:
elementType: O O N C C C C C C C C C C C C C C C C
charge: -0.316089 -0.184629 -0.040304 0.178242 0.170283 0.213116 0.257226 -0.042669 0.158029 0.052008 -0.009498 -0.046096 -0.157194 -0.177229 0.011129 -0.024529 -0.044840 -0.004740 0.007785
polarizability: 2.13538996e+02 -4.87591359e+00 1.83591552e+02 1.70210454e+01 9.94398524e+00 1.49713642e+02
1716.lowfreq: -10.3214 -7.4721 -0.0004 0.0002 0.0005 7.5698 28.5890 42.4311 45.5691
frequency: 28.4075 42.3697 45.5583 54.7476 80.6051 98.5219 102.1464 116.8253 119.3962 154.6877 161.9737 169.4452 177.9465 190.1943 218.4338 229.9499 247.9294 273.2447 299.3933 302.5781 328.4853 344.5238 362.2385 416.0630 434.2673 470.7014 501.2123 518.4183 534.9084 554.1112 571.5009 598.7581 623.8368 652.1213 692.8123 709.7563 750.2930 759.2744 765.2051 797.3507 857.6399 872.5025 901.6622 916.4392 926.7164 941.8679 944.6655 952.3053 958.4327 986.1060 995.7511 1015.1796 1024.8043 1041.1787 1053.0073 1073.4223 1081.4855 1105.2968 1118.6063 1132.4201 1134.7012 1155.0079 1165.4751 1172.8508 1187.1363 1193.2713 1200.0727 1212.3998 1264.4092 1272.4582 1279.7828 1289.2050 1295.1841 1340.9786 1363.7581 1373.1278 1375.6829 1389.0837 1390.7666 1435.9356 1437.6242 1440.7811 1444.5629 1448.6346 1454.1199 1459.3349 1461.5053 1463.8117 1464.9354 1472.7771 1475.1914 1484.7314 1488.9351 1498.4964 1595.1018 1611.6216 1634.1007 2815.3099 2862.3157 2956.7595 2979.6391 2984.4935 2988.3639 2988.4938 2989.4289 3010.5803 3036.7349 3073.4547 3074.3512 3075.4884 3079.6467 3086.9026 3100.0847 3115.7811 3119.5997 3122.1082 3128.3800 3142.8446 3162.7562 3448.4433
redmass: 3.3411 2.2795 3.7770 3.3735 3.6656 3.2997 1.7838 1.6404 3.0681 2.5426 2.2184 1.1856 2.3393 3.1928 1.2934 1.2099 3.1228 2.5507 2.8113 3.0646 3.3314 2.9647 3.2031 4.0919 3.4842 3.6370 3.5448 3.9106 3.9963 3.5078 3.3526 4.3136 2.2560 1.7480 4.3323 4.0419 1.3651 2.2434 1.7595 2.0226 1.9830 1.3716 4.0963 2.1568 1.6883 1.7996 2.0437 1.7381 2.1815 1.3231 1.3041 2.0826 2.3606 2.6079 3.3072 2.5508 1.6630 2.0647 1.8158 1.9662 1.7844 1.9765 3.4779 1.0987 2.7675 3.3593 2.6103 1.7567 1.3802 1.5132 1.3002 1.1483 2.5511 1.4074 1.2349 1.2128 1.4882 5.8551 1.2704 1.1509 1.0826 2.1918 1.0627 1.1949 1.1306 1.3766 1.1003 1.0636 1.0780 1.4754 1.0879 1.0715 1.0648 1.0721 7.1975 6.9371 9.0717 1.0716 1.0573 1.0696 1.0610 1.0360 1.0368 1.0558 1.0621 1.0739 1.0970 1.0954 1.0992 1.0961 1.0987 1.0987 1.1009 1.0999 1.1000 1.0863 1.0892 1.0940 1.1002 1.0745
irintensity: 0.4849 2.4970 0.7653 2.7045 1.1344 3.0263 1.6241 2.9533 0.4733 0.5869 0.3888 0.1906 0.8038 0.2408 0.6172 1.3774 1.7453 0.0551 0.6917 1.5279 0.3398 5.7889 5.6066 1.9503 2.0670 7.1543 4.7769 0.6361 1.8592 15.1536 9.9483 18.0832 35.7612 68.7167 6.5830 6.0693 5.5516 22.9952 44.5789 6.8425 11.6784 0.3010 1.9430 28.3099 22.3395 17.4654 25.4543 1.8204 6.1074 0.0526 0.0598 5.7307 8.7002 11.7657 7.0947 13.6509 10.4740 18.9797 10.8315 6.8143 49.4787 16.0804 31.8624 0.1986 20.2845 18.8355 14.2694 8.1611 10.7906 7.3635 2.0950 2.2717 23.6581 1.5910 58.7537 26.0245 15.9123 4.0352 19.6818 1.3264 25.6421 12.9197 6.0263 24.1361 3.9367 2.0185 7.0312 4.3370 8.1161 8.2072 15.2143 16.4447 13.0163 6.0589 0.2474 6.5341 102.2905 104.7377 177.3674 16.9387 19.0354 13.4411 46.5232 14.9322 33.6167 51.6351 20.4381 29.5851 40.7328 10.2447 6.2598 40.7603 25.8052 10.4035 14.4422 6.5700 3.7706 27.2946 27.9784 1.1669
temp: 298.150 k
press: 1.00000 atm
elementType: 8 8 7 6 6 6 6 6 6 6 6 6 6 6 6 6 6 6 6 1 1 1 1 1 1 1 1 1 1 1 1 1 1 1 1 1 1 1 1 1 1 1
symmnumber: 1
zpe: 930510.4 jmol-1
zpe.correction: 0.354413 hartree
zpe.thermalcorrener: 0.375233 hartree
zpe.thermalcorrenthalpy: 0.376177 hartree
zpe.thermalcorrgfe: 0.304450 hartree
zpe.sumelectzpe: -827.228717 hartree
zpe.sumelectthermal: -827.207897 hartree
zpe.sumelectthermalent: -827.206953 hartree
zpe.sumelectthermalfe: -827.278680 hartree
dipole: -0.2879 -3.0498 -2.4600
dipole: 3.9288
quadrupole: -102.1348 -108.6890 -122.9320
quadrupole: -7.7349 6.4775 -2.2391
quadrupole: 9.1171 2.5629 -11.6801 -7.7349 6.4775 -2.2391
hfenergy: -827.5831301 hartree
pointgroup: C01 [X(C16H23N1O2)]
dipole: 0.2021188 -1.2964857 0.8170248 debye
polarizability: 214.2022691|4.0939679|185.7723969|15.7239251|-5.0509785|146.8695245 unknown
InChI: InChI=1S/C16H23NO2/c1-12(18)16(10-7-11-17-4)14-9-6-5-8-13(14)15(2,3)19-16/h5-6,8-9,17H,7,10-11H2,1-4H3
charge 0 multiplicity 1
42 atoms
O  0.041173 1.326072 -0.235092
O  0.188378 0.236486 -2.774648
N  -5.033156 0.222636 0.485902
C  -0.042278 -0.1455 -0.347587
C  1.452663 1.776019 0.059454
C  1.3012 -0.636335 0.19947
C  2.160423 0.46906 0.398241
C  -1.26414 -0.615384 0.481448
C  -0.144971 -0.557882 -1.863155
C  -2.592138 0.041832 0.047328
C  2.032677 2.473977 -1.188962
C  1.359807 2.736724 1.261601
C  1.729693 -1.944908 0.500244
C  3.46865 0.278881 0.882277
C  -3.778221 -0.426139 0.91167
C  3.042793 -2.138663 0.992791
C  -0.620806 -1.972277 -2.18515
C  3.909607 -1.034382 1.17585
C  -6.224135 -0.16635 1.260856
H  -1.342263 -1.720159 0.429274
H  -1.05677 -0.359866 1.538162
H  -2.496245 1.138941 0.118078
H  -2.804328 -0.18891 -1.019085
H  1.449469 3.384687 -1.410889
H  1.970921 1.806879 -2.062905
H  3.086786 2.762745 -1.016997
H  0.690967 3.578245 1.011027
H  2.355909 3.145434 1.513111
H  0.954346 2.217141 2.146314
H  1.061743 -2.805054 0.374933
H  4.136808 1.13337 1.039309
H  -3.839417 -1.547958 0.885002
H  -3.592556 -0.149916 1.969804
H  3.389623 -3.149019 1.235942
H  -0.032747 -2.728308 -1.634138
H  -1.679067 -2.103515 -1.893547
H  -0.520299 -2.149566 -3.267141
H  4.924707 -1.197539 1.554543
H  -5.179939 0.132563 -0.528234
H  -6.10391 0.160193 2.310985
H  -6.42835 -1.266564 1.275825
H  -7.116209 0.343208 0.855389
