program: Orca
programVersion: 4.2.1
elementType: Cl O N N N C C C C C C C C C C C C C C C C C H H H H H H H H H H H H H H H H H H H H
charge: 0
multiplicity: 1
keywords: wb97x-d3
keywords: def2-TZVPP
keywords: def2/J RIJCOSX GRIDX6 NOFINALGRIDX
keywords: grid4 nofinalgrid
keywords: scfconv7
keywords: smallprint printgap noloewdin
keywords: NOSOSCF
formula: C17H20ClN3O
InChI: InChI=1S/C17H20ClN3O/c1-16(2)8-7-14(9-13-3-5-15(18)6-4-13)17(16,22)10-21-12-19-11-20-21/h3-6,9,11-12,22H,7-8,10H2,1-2H3
42 atoms
Cl 5.921175 0.122212 -0.399312
O  -2.748583 0.28153 1.630039
N  -2.113385 -1.832472 -0.305426
N  -2.239693 -2.42996 0.884375
N  -0.655164 -3.439389 -0.323481
C  -3.134518 1.857438 -0.173905
C  -2.43087 0.554123 0.292583
C  -2.29238 2.250743 -1.394124
C  -0.955229 0.846928 0.037021
C  -0.846931 1.938878 -0.994452
C  -2.858926 -0.633908 -0.60468
C  -2.998749 2.926876 0.914266
C  -4.610375 1.689375 -0.511577
C  0.022002 0.159386 0.633287
C  1.464114 0.222974 0.386619
C  -1.155506 -2.435386 -1.008116
C  2.141556 1.354829 -0.073695
C  2.217757 -0.932062 0.621495
C  -1.347031 -3.389497 0.828277
C  3.506932 1.330417 -0.310562
C  3.579501 -0.976095 0.380025
C  4.216921 0.161307 -0.09059
H  -2.431882 3.298565 -1.664481
H  -2.586402 1.665272 -2.269671
H  -0.384655 2.828096 -0.558996
H  -0.221127 1.654939 -1.844463
H  -2.706258 -0.414972 -1.659832
H  -3.917348 -0.853103 -0.459439
H  -1.972339 3.057861 1.26291
H  -3.33419 3.890284 0.524809
H  -3.61202 2.698514 1.785915
H  -5.051979 2.657889 -0.755136
H  -4.778017 1.041803 -1.373683
H  -5.172164 1.281182 0.331193
H  -2.634417 -0.663326 1.811736
H  -0.260784 -0.599053 1.358657
H  -0.867436 -2.121651 -1.999031
H  1.616803 2.285209 -0.232984
H  1.725157 -1.825468 0.985815
H  -1.196881 -4.077269 1.645759
H  4.009145 2.222524 -0.659962
H  4.133364 -1.888102 0.557135
elementType: Cl O N C H
totalener: -1359.62811844 hartree
nucrepener: 1957.02117523 hartree
electener: -3316.64929367 hartree
oneelecener: -5744.96642151 hartree
twoeener: 2428.31712784 hartree
cpcmener: -0.02618690 hartree
kineticenergy: 1354.97021858 hartree
xcener: -109.836691236717 hartree
chargesum: 0.0000000
charge: -0.101598 -0.429497 0.131969 -0.389779 -0.402694 0.262954 0.511517 -0.255240 -0.263201 -0.138697 -0.178891 -0.359315 -0.343890 -0.120470 0.082788 0.062810 -0.246067 -0.191159 0.084700 -0.156235 -0.188916 0.123249 0.084501 0.085404 0.107056 0.109750 0.124115 0.141987 0.101612 0.097273 0.097258 0.103136 0.089567 0.102630 0.223472 0.116089 0.174664 0.164527 0.137897 0.162397 0.140797 0.141530
qa: -0.1016 -0.4295 0.1320 -0.3898 -0.4027 0.2630 0.5115 -0.2552 -0.2632 -0.1387 -0.1789 -0.3593 -0.3439 -0.1205 0.0828 0.0628 -0.2461 -0.1912 0.0847 -0.1562 -0.1889 0.1232 0.0845 0.0854 0.1071 0.1097 0.1241 0.1420 0.1016 0.0973 0.0973 0.1031 0.0896 0.1026 0.2235 0.1161 0.1747 0.1645 0.1379 0.1624 0.1408 0.1415
va: 1.2045 2.0256 3.3311 2.8475 3.0025 3.6755 3.7486 4.0087 3.6353 3.9185 3.9219 3.9498 3.9102 3.8031 3.5692 4.0467 3.9928 4.0027 3.9990 4.0070 4.0454 3.8086 1.0172 1.0122 0.9965 1.0043 0.9978 0.9931 0.9980 1.0043 1.0138 1.0028 1.0000 1.0106 1.0601 1.0317 0.9929 0.9926 1.0144 0.9949 1.0091 1.0084
dispcorr: -0.024166494 hartree
energy: -1359.652284931811
dipole: -35.83065 34.38488 -1.44577 14.91618 -14.06610 0.85008 -2.42239 0.96699 -1.45540
magnitude: 2.22060 au
magnitude: 5.64431 debye
