program: Orca
programVersion: 4.2.1
elementType: Cl O N N N C C C C C C C C C C C C C C C C C H H H H H H H H H H H H H H H H H H H H
charge: 0
multiplicity: 1
keywords: wb97x-d3
keywords: def2-TZVPP
keywords: def2/J RIJCOSX GRIDX6 NOFINALGRIDX
keywords: grid4 nofinalgrid
keywords: scfconv7
keywords: smallprint printgap noloewdin
keywords: NOSOSCF
formula: C17H20ClN3O
InChI: InChI=1S/C17H20ClN3O/c1-16(2)8-7-14(9-13-3-5-15(18)6-4-13)17(16,22)10-21-12-19-11-20-21/h3-6,9,11-12,22H,7-8,10H2,1-2H3
42 atoms
Cl 5.936602 0.099688 -0.219536
O  -2.630463 0.232665 1.72338
N  -2.212737 -1.821389 -0.306633
N  -1.356976 -2.142044 -1.278904
N  -1.127504 -3.54011 0.451935
C  -3.117153 1.882708 -0.075391
C  -2.445309 0.552156 0.371148
C  -2.418702 2.151281 -1.415447
C  -0.999042 0.751869 -0.040369
C  -0.975004 1.645431 -1.24809
C  -3.036489 -0.642924 -0.404004
C  -2.766365 2.990817 0.920987
C  -4.632936 1.800151 -0.202861
C  0.011179 0.204532 0.640851
C  1.447367 0.236463 0.376731
C  -2.060813 -2.657837 0.72229
C  2.041227 0.745874 -0.782976
C  2.296602 -0.317791 1.342292
C  -0.729719 -3.177468 -0.782863
C  3.41377 0.709119 -0.96637
C  3.668885 -0.362183 1.174409
C  4.221412 0.155403 0.013611
H  -2.456362 3.207312 -1.685538
H  -2.920316 1.611639 -2.22163
H  -0.276387 2.472497 -1.10062
H  -0.638113 1.109804 -2.139424
H  -3.138688 -0.421757 -1.463671
H  -4.028767 -0.876656 -0.017333
H  -1.691432 3.088935 1.091045
H  -3.118704 3.952263 0.543611
H  -3.245217 2.837517 1.889989
H  -5.097372 1.500899 0.739105
H  -5.04436 2.775095 -0.47074
H  -4.955983 1.099609 -0.974293
H  -2.107761 0.834411 2.265077
H  -0.248128 -0.375723 1.521859
H  -2.645851 -2.594198 1.625337
H  1.44316 1.164858 -1.577103
H  1.87231 -0.730438 2.249518
H  0.040396 -3.69427 -1.334321
H  3.845104 1.10526 -1.875713
H  4.296455 -0.799601 1.939195
elementType: Cl O N C H
totalener: -1359.62811879 hartree
nucrepener: 1955.34104384 hartree
electener: -3314.96916263 hartree
oneelecener: -5741.85673075 hartree
twoeener: 2426.88756812 hartree
cpcmener: -0.02671985 hartree
kineticenergy: 1354.99310974 hartree
xcener: -109.837259545344 hartree
chargesum: -0.0000000
charge: -0.100505 -0.402525 0.122358 -0.337716 -0.406506 0.224048 0.565810 -0.262295 -0.316311 -0.120304 -0.196107 -0.366731 -0.342088 -0.070144 0.062403 0.049066 -0.241493 -0.169175 0.051579 -0.168982 -0.178560 0.126801 0.082419 0.089283 0.116642 0.092192 0.131478 0.138282 0.113348 0.097224 0.096551 0.102208 0.103503 0.090320 0.222431 0.095906 0.166159 0.165323 0.135142 0.158599 0.138718 0.141646
qa: -0.1005 -0.4025 0.1224 -0.3377 -0.4065 0.2240 0.5658 -0.2623 -0.3163 -0.1203 -0.1961 -0.3667 -0.3421 -0.0701 0.0624 0.0491 -0.2415 -0.1692 0.0516 -0.1690 -0.1786 0.1268 0.0824 0.0893 0.1166 0.0922 0.1315 0.1383 0.1133 0.0972 0.0966 0.1022 0.1035 0.0903 0.2224 0.0959 0.1662 0.1653 0.1351 0.1586 0.1387 0.1416
va: 1.2064 2.0481 3.3852 2.8743 3.0299 3.7866 3.6279 4.0272 3.6019 3.8566 3.9091 3.9334 3.9030 3.6757 3.6713 4.0708 4.0002 3.9902 4.0486 4.0474 4.0103 3.8022 1.0157 1.0101 0.9919 1.0134 1.0081 0.9976 0.9934 1.0060 1.0093 1.0094 1.0035 1.0012 1.0151 1.0489 1.0085 0.9919 1.0096 0.9968 1.0102 1.0073
dispcorr: -0.023884842 hartree
energy: -1359.652003628908
dipole: -36.24283 34.43939 -1.80345 16.04775 -14.01129 2.03646 -0.54499 0.61862 0.07363
magnitude: 2.72122 au
magnitude: 6.91679 debye
