program: Orca
programVersion: 4.2.1
elementType: O N N N C C C C C C C C C C C H H H H H H H H H H H H H H H C C C C C C H H H H Cl H
charge: 0
multiplicity: 1
keywords: wb97x-d3
keywords: def2-TZVPP
keywords: def2/J RIJCOSX GRIDX6 NOFINALGRIDX
keywords: grid4 nofinalgrid
keywords: scfconv7
keywords: smallprint printgap noloewdin
keywords: NOSOSCF
formula: C17H20ClN3O
InChI: InChI=1S/C17H20ClN3O/c1-16(2)8-7-14(9-13-3-5-15(18)6-4-13)17(16,22)10-21-12-19-11-20-21/h3-6,9,11-12,22H,7-8,10H2,1-2H3
42 atoms
O  1.277657 0.706155 -1.486768
N  0.769357 -2.103928 -0.718206
N  0.556978 -1.972998 -2.032246
N  1.071319 -4.094448 -1.539386
C  3.14911 -0.185851 -0.167639
C  1.624268 0.182049 -0.217813
C  3.786137 1.192826 0.053653
C  1.513615 1.345116 0.769718
C  2.900158 1.844387 1.105377
C  0.682602 -0.966857 0.174817
C  3.693645 -0.84024 -1.43231
C  3.477271 -1.07948 1.033205
C  0.422127 1.926243 1.27441
C  1.076922 -3.369144 -0.443659
C  0.754892 -3.18863 -2.479614
H  3.760733 1.771063 -0.873731
H  4.831093 1.116263 0.358299
H  2.951637 2.93351 1.100171
H  3.193529 1.523208 2.108848
H  -0.350824 -0.627523 0.176687
H  0.9002 -1.324534 1.178243
H  4.776488 -0.948992 -1.342802
H  3.29462 -1.840925 -1.60619
H  3.507663 -0.240398 -2.323204
H  3.151667 -2.109944 0.886271
H  4.558557 -1.113878 1.179231
H  3.039329 -0.728854 1.969298
H  1.133759 -0.036012 -2.094808
H  1.27816 -3.722893 0.555016
H  0.659698 -3.428035 -3.52685
C  -1.011109 1.671497 1.055846
C  -3.757408 1.288939 0.764315
C  -1.860859 1.668833 2.164505
C  -1.581494 1.50371 -0.207218
C  -2.946005 1.311537 -0.358235
C  -3.224397 1.468051 2.031319
H  -1.448425 1.818438 3.154489
H  -0.955809 1.52564 -1.087583
H  -3.368206 1.187383 -1.346178
H  -3.860647 1.456742 2.905588
Cl -5.46321 1.047758 0.581827
H  0.608164 2.725881 1.988353
elementType: O N C H Cl
totalener: -1359.61025005 hartree
nucrepener: 1967.06616747 hartree
electener: -3326.67641752 hartree
oneelecener: -5765.18487050 hartree
twoeener: 2438.50845298 hartree
cpcmener: -0.02707555 hartree
kineticenergy: 1354.99279518 hartree
xcener: -109.837873880774 hartree
chargesum: -0.0000000
charge: -0.467477 0.144494 -0.384382 -0.409137 0.278170 0.510904 -0.238146 -0.301563 -0.074557 -0.256140 -0.365916 -0.389462 -0.027163 0.061845 0.080528 0.085647 0.083347 0.093719 0.093688 0.175588 0.139870 0.107054 0.095012 0.098111 0.103123 0.103299 0.108731 0.230341 0.180449 0.164562 0.001600 0.112649 -0.184889 -0.249694 -0.153216 -0.178936 0.142616 0.168156 0.145869 0.145577 -0.102399 0.128125
qa: -0.4675 0.1445 -0.3844 -0.4091 0.2782 0.5109 -0.2381 -0.3016 -0.0746 -0.2561 -0.3659 -0.3895 -0.0272 0.0618 0.0805 0.0856 0.0833 0.0937 0.0937 0.1756 0.1399 0.1071 0.0950 0.0981 0.1031 0.1033 0.1087 0.2303 0.1804 0.1646 0.0016 0.1126 -0.1849 -0.2497 -0.1532 -0.1789 0.1426 0.1682 0.1459 0.1456 -0.1024 0.1281
va: 1.9571 3.3145 2.8480 3.0233 3.7273 3.6068 3.9561 3.8804 3.8777 3.9145 3.9153 3.9625 3.7515 4.0448 4.0142 1.0215 1.0193 1.0134 1.0018 0.9902 0.9931 1.0034 1.0005 1.0160 1.0025 1.0062 0.9959 1.0516 0.9904 0.9943 3.5956 3.8076 3.9913 3.9096 4.0030 3.9980 1.0057 1.0389 1.0068 1.0055 1.2043 1.0005
dispcorr: -0.024539405 hartree
energy: -1359.634789455933
dipole: 37.24773 -35.91790 1.32982 -1.67993 1.79989 0.11997 2.23468 -0.50746 1.72722
magnitude: 2.18315 au
magnitude: 5.54912 debye
