program: Orca
programVersion: 4.2.1
elementType: O N N N C C C C C C C C C C C H H H H H H H H H H H H H H H C C C C C C H H H H Cl H
charge: 0
multiplicity: 1
keywords: wb97x-d3
keywords: def2-TZVPP
keywords: def2/J RIJCOSX GRIDX6 NOFINALGRIDX
keywords: grid4 nofinalgrid
keywords: scfconv7
keywords: smallprint printgap noloewdin
keywords: NOSOSCF
formula: C17H20ClN3O
InChI: InChI=1S/C17H20ClN3O/c1-16(2)8-7-14(9-13-3-5-15(18)6-4-13)17(16,22)10-21-12-19-11-20-21/h3-6,9,11-12,22H,7-8,10H2,1-2H3
42 atoms
O  1.290084 0.794429 -1.3632
N  0.720918 -1.918072 -0.444935
N  -0.269995 -1.594912 -1.285515
N  -1.019398 -2.986352 0.299146
C  3.517693 0.712181 -0.445458
C  2.06345 0.168731 -0.375498
C  4.105226 0.240281 0.888559
C  1.687448 0.431625 1.075599
C  2.958375 0.366138 1.898733
C  2.044753 -1.361956 -0.59803
C  3.47969 2.243209 -0.472713
C  4.315627 0.21752 -1.644161
C  0.499086 0.641741 1.642546
C  0.253514 -2.731452 0.498974
C  -1.290478 -2.252247 -0.793425
H  4.978672 0.828434 1.17338
H  4.443199 -0.795819 0.811147
H  3.058173 1.269341 2.503316
H  2.940069 -0.471204 2.599163
H  2.691601 -1.882622 0.10599
H  2.394257 -1.598466 -1.603111
H  4.492286 2.636401 -0.364724
H  3.079954 2.626151 -1.411551
H  2.879674 2.665894 0.336041
H  4.490944 -0.859043 -1.621822
H  3.821807 0.460646 -2.586875
H  5.297169 0.695314 -1.660473
H  0.467091 0.299355 -1.489958
H  0.869714 -3.125778 1.291593
H  -2.26507 -2.20764 -1.252712
C  -0.847727 0.728269 1.05104
C  -3.449448 0.823029 0.055853
C  -1.192101 1.615049 0.030703
C  -1.857318 -0.068404 1.593377
C  -3.150517 -0.037069 1.099655
C  -2.482168 1.660297 -0.47519
H  -0.451422 2.291224 -0.370311
H  -1.625454 -0.741024 2.409166
H  -3.911232 -0.677825 1.524365
H  -2.7277 2.352331 -1.269367
Cl -5.062853 0.870173 -0.5778
H  0.501518 0.719464 2.728367
elementType: O N C H Cl
totalener: -1359.61068854 hartree
nucrepener: 2035.31739125 hartree
electener: -3394.92807978 hartree
oneelecener: -5902.04653828 hartree
twoeener: 2507.11845850 hartree
cpcmener: -0.02749891 hartree
kineticenergy: 1355.00139364 hartree
xcener: -109.842549057066 hartree
chargesum: 0.0000000
charge: -0.446024 0.138149 -0.372885 -0.409073 0.245706 0.638099 -0.238769 -0.377792 -0.108404 -0.208219 -0.362889 -0.352002 -0.052155 0.056907 0.083680 0.081248 0.085949 0.104259 0.095439 0.131508 0.141562 0.099311 0.094250 0.102190 0.091697 0.100860 0.103942 0.223102 0.174016 0.156414 0.024083 0.114310 -0.232629 -0.185970 -0.178395 -0.146576 0.151501 0.131966 0.141493 0.144690 -0.107737 0.123190
qa: -0.4460 0.1381 -0.3729 -0.4091 0.2457 0.6381 -0.2388 -0.3778 -0.1084 -0.2082 -0.3629 -0.3520 -0.0522 0.0569 0.0837 0.0812 0.0859 0.1043 0.0954 0.1315 0.1416 0.0993 0.0943 0.1022 0.0917 0.1009 0.1039 0.2231 0.1740 0.1564 0.0241 0.1143 -0.2326 -0.1860 -0.1784 -0.1466 0.1515 0.1320 0.1415 0.1447 -0.1077 0.1232
va: 2.0046 3.3388 2.8445 2.9933 3.7259 3.5033 3.9829 3.9034 3.8653 3.9565 3.9457 3.9083 3.7237 4.0594 4.0143 1.0168 1.0111 1.0027 1.0102 0.9938 0.9923 1.0052 1.0147 0.9967 0.9999 1.0121 1.0023 1.0664 0.9941 0.9962 3.5441 3.7850 3.9195 3.9101 3.9742 4.0003 1.0234 1.0143 1.0078 1.0054 1.1979 1.0008
dispcorr: -0.027195246 hartree
energy: -1359.637883780556
dipole: 40.21829 -37.56897 2.64932 3.13415 -3.67464 -0.54049 2.48762 -1.38895 1.09867
magnitude: 2.91858 au
magnitude: 7.41845 debye
