program: Gaussian 09
title: 000030879
version: EM64L-G09RevD.01
frameworkgroup: C1[X(C16H22ClNO2)]
method: RPBEPBE
basis: SDD
operation: Freq
keyword: #p
keyword: freq=noraman
keyword: PBEPBE/SDD
title: #p freq=noraman PBEPBE/SDD
converged: YES YES NO NO
title: Mulliken charges:
elementType: Cl O O N C C C C C C C C C C C C C C C C H H H H H H H H H H H H H H H H H H H H H H
charge: -0.047455 -0.290785 -0.254369 -0.128279 0.029103 -0.410835 -0.365195 -0.415461 -0.391214 -0.341617 -0.760242 -0.451904 -0.238603 0.194930 0.225860 -0.331066 -0.325489 -0.209482 -0.201135 -0.094108 0.172265 0.188956 0.204089 0.209399 0.173666 0.190190 0.215689 0.205464 0.193021 0.193342 0.213330 0.212395 0.218597 0.230906 0.216975 0.219108 0.259189 0.219988 0.276409 0.275022 0.260810 0.258538
chargesum: 0.00000
title: Mulliken charges with hydrogens summed into heavy atoms:
elementType: Cl O O N C C C C C C C C C C C C C C C C
charge: -0.047455 -0.290785 -0.254369 -0.128279 0.201368 -0.017790 0.017869 -0.009582 0.007271 0.065054 -0.098344 -0.015821 0.240574 0.194930 0.225860 -0.054657 -0.050467 0.051329 0.057403 -0.094108
polarizability: 2.84474929e+02 1.78889632e+01 1.67894192e+02 2.21901702e+00 -1.93428671e+01 1.47610518e+02
1716.lowfreq: -22.6344 -4.4089 -0.0026 -0.0023 -0.0023 1.5392 5.8157 14.1540 21.4722
frequency: -20.5497 12.6821 20.1556 43.1858 53.6570 73.4718 81.1595 89.2876 152.7941 163.3251 178.0423 197.1079 214.5949 251.8404 276.1761 286.1165 299.9461 310.9416 324.7488 330.2471 364.1199 409.9811 412.7216 439.1651 445.7159 474.9344 484.7587 501.2320 542.3158 557.6086 622.4252 669.2504 694.2704 697.7162 740.7760 787.4584 801.8355 815.1963 825.7091 839.0965 851.1191 864.0738 877.7703 894.3761 925.9619 933.8555 977.1243 978.3144 988.5322 988.7992 997.4705 999.8295 1046.4269 1066.7797 1069.7338 1077.4122 1084.6070 1103.6995 1107.7645 1115.8369 1125.9749 1134.5971 1154.7453 1169.9887 1177.0830 1210.9029 1223.5123 1243.8988 1250.4328 1262.7571 1271.2435 1274.8036 1289.8213 1302.2484 1315.8999 1323.2948 1338.9097 1348.5325 1353.2035 1363.8074 1368.4819 1376.8133 1382.5794 1386.0556 1395.9743 1448.7354 1457.7325 1463.8897 1464.4472 1471.6250 1472.0751 1475.7084 1478.7081 1486.4424 1488.0656 1576.7452 1598.2861 1617.6170 2807.9595 2824.4823 2853.2924 2967.4077 2976.9231 2981.6395 2985.9457 3004.0080 3013.5327 3031.2461 3038.4187 3040.6119 3048.2230 3052.5077 3066.1621 3076.9159 3081.5716 3093.4137 3156.6996 3164.6228 3176.2672 3185.0867
redmass: 3.2366 5.9478 4.7113 4.3238 5.8298 4.1826 7.6428 3.1233 3.5302 2.7356 2.7424 1.4721 2.7473 2.4804 6.4373 5.0044 5.6522 2.7623 1.9321 2.3086 2.7949 2.9070 3.2098 3.4197 3.4585 3.4116 3.1080 6.1347 1.6794 3.4361 7.1401 4.7364 4.4531 3.3344 3.8001 1.4212 5.8967 1.5560 1.8951 1.2574 1.5979 2.1771 2.1185 1.4539 1.9404 4.0414 1.4963 1.8129 1.3828 1.6882 1.4142 4.1987 1.9407 5.5965 2.6308 2.1192 2.5120 2.6349 1.3783 1.7398 1.7028 2.1911 2.1831 1.3028 1.1222 1.7470 1.5258 3.2207 1.3268 1.2599 1.2239 1.2231 1.2480 1.2901 1.3201 1.2626 1.4023 1.5154 1.6273 1.5064 1.3850 5.7480 1.2561 1.3743 4.0216 1.0905 1.0876 1.0789 1.0853 1.2841 1.8084 1.0697 1.0800 1.0899 1.0568 8.5330 6.2890 11.0656 1.0800 1.0719 1.0716 1.0620 1.0553 1.0417 1.0614 1.0611 1.0596 1.0955 1.0884 1.1029 1.0935 1.1034 1.0934 1.0969 1.0998 1.1061 1.0889 1.0891 1.0971 1.0972
irintensity: 0.0571 0.1640 0.0410 0.0454 0.0778 0.4321 0.7328 0.4525 3.0061 0.8063 1.9607 1.7840 2.2141 0.2890 2.6268 6.6373 0.2212 16.5091 8.1116 3.0975 0.4723 0.0025 0.7338 0.3881 1.8429 11.6635 3.7977 23.2341 0.8292 2.9533 1.5590 20.9795 20.1596 3.6588 24.9610 1.2942 6.0540 2.0635 0.7966 1.9130 49.4360 4.4359 3.8809 6.1667 3.5330 24.0140 0.4683 2.4682 1.6054 5.3253 16.0549 100.2089 17.8031 310.2365 70.7317 20.3208 16.9709 22.7204 12.8057 5.3370 7.8780 13.1950 19.0321 0.3748 42.4050 12.0136 17.5235 360.8863 40.8025 8.7809 7.8137 6.4061 0.6036 4.9963 16.7581 11.7276 1.0444 1.3380 6.6277 7.9769 5.2591 5.6556 16.8767 2.1844 15.9797 6.9931 7.7862 6.1190 8.2621 6.6721 44.3106 9.9325 2.2788 13.8000 15.6980 13.8588 87.3420 181.4610 52.3050 107.9705 163.1629 41.4598 16.4796 44.2107 29.0540 17.0435 19.3299 75.5215 34.3798 24.3693 2.0023 82.7441 28.7616 46.8870 39.5253 44.3879 0.0001 0.8448 3.5823 1.8896
temp: 298.150 k
press: 1.00000 atm
elementType: 17 8 8 7 6 6 6 6 6 6 6 6 6 6 6 6 6 6 6 6 1 1 1 1 1 1 1 1 1 1 1 1 1 1 1 1 1 1 1 1 1 1
symmnumber: 1
zpe: 918778.9 jmol-1
zpe.correction: 0.349944 hartree
zpe.thermalcorrener: 0.369216 hartree
zpe.thermalcorrenthalpy: 0.370161 hartree
zpe.thermalcorrgfe: 0.299453 hartree
zpe.sumelectzpe: -1286.633508 hartree
zpe.sumelectthermal: -1286.614236 hartree
zpe.sumelectthermalent: -1286.613291 hartree
zpe.sumelectthermalfe: -1286.683999 hartree
dipole: 2.9632 -1.3892 1.5826
dipole: 3.6352
quadrupole: -125.6984 -127.4587 -125.5199
quadrupole: -2.4314 2.7577 -0.3937
quadrupole: 0.5272 -1.2330 0.7058 -2.4314 2.7577 -0.3937
hfenergy: -1286.983452 hartree
pointgroup: C01 [X(C16H22Cl1N1O2)]
dipole: -1.1621573 0.4056952 -0.7282177 debye
polarizability: 284.7624086|-7.2979834|137.7786017|-15.3765865|-9.0840972|177.4386277 unknown
InChI: InChI=1S/C16H22ClNO2/c1-13-5-2-3-10-18(13)11-4-12-20-16(19)14-6-8-15(17)9-7-14/h6-9,13H,2-5,10-12H2,1H3
charge 0 multiplicity 1
42 atoms
Cl 7.527713 -0.292244 -0.714996
O  0.821625 0.594499 -0.038706
O  1.243387 -0.232392 2.101241
N  -3.530777 0.308117 -0.370938
C  -4.860243 0.449578 0.313194
C  -5.471305 -0.955851 0.550624
C  -3.653768 -0.441892 -1.653473
C  -5.597524 -1.775804 -0.748621
C  -4.225199 -1.855759 -1.446284
C  -2.823516 1.601005 -0.586498
C  -4.747699 1.189569 1.664142
C  -1.308349 1.428908 -0.849101
C  -0.628704 0.69688 0.307593
C  1.657754 0.100166 0.961927
C  3.080292 0.021787 0.515943
C  4.045945 -0.443689 1.445375
C  3.484164 0.391526 -0.79303
C  5.403239 -0.541453 1.078963
C  4.839159 0.297334 -1.172887
C  5.776619 -0.168218 -0.22854
H  -5.567347 1.019501 -0.350148
H  -6.463589 -0.831494 1.025588
H  -4.822579 -1.495233 1.269554
H  -2.653229 -0.513222 -2.115744
H  -4.309363 0.116944 -2.374578
H  -6.327774 -1.287351 -1.426919
H  -5.987457 -2.788007 -0.529899
H  -3.522391 -2.440562 -0.821832
H  -4.307668 -2.36476 -2.426022
H  -3.273694 2.179527 -1.433829
H  -2.941044 2.218888 0.319513
H  -4.577262 2.27529 1.558998
H  -5.688412 1.063681 2.23021
H  -3.924563 0.759313 2.264053
H  -1.121727 0.881594 -1.790839
H  -0.856013 2.43182 -0.969676
H  -1.038046 -0.317747 0.4471
H  -0.725662 1.242258 1.264598
H  3.715519 -0.725355 2.450263
H  2.734966 0.749291 -1.504029
H  6.153566 -0.898993 1.789566
H  5.161254 0.578848 -2.179255
