program: Orca
programVersion: 4.2.1
elementType: O N N N C C C C C C C C C C C H H H H H H H H H H H H H H H C C C C C C H H H H Cl H
charge: 0
multiplicity: 1
keywords: wb97x-d3
keywords: def2-TZVPP
keywords: def2/J RIJCOSX GRIDX6 NOFINALGRIDX
keywords: grid4 nofinalgrid
keywords: scfconv7
keywords: smallprint printgap noloewdin
keywords: NOSOSCF
formula: C17H20ClN3O
InChI: InChI=1S/C17H20ClN3O/c1-16(2)8-7-14(9-13-3-5-15(18)6-4-13)17(16,22)10-21-12-19-11-20-21/h3-6,9,11-12,22H,7-8,10H2,1-2H3
42 atoms
O  1.153047 0.714413 -1.328444
N  0.771991 -2.042291 -0.432344
N  0.452546 -2.640969 0.716445
N  -1.212102 -2.86255 -0.763593
C  3.416154 0.747602 -0.482339
C  1.991928 0.130655 -0.371964
C  4.071128 0.272335 0.823206
C  1.65659 0.379652 1.086806
C  2.945221 0.255536 1.869406
C  2.048395 -1.394131 -0.624329
C  3.30847 2.274928 -0.475408
C  4.198465 0.316838 -1.71644
C  0.491704 0.661683 1.665763
C  -0.23223 -2.17973 -1.305097
C  -0.742891 -3.116942 0.472855
H  4.898069 0.922562 1.111958
H  4.49831 -0.725142 0.695761
H  3.036701 1.075409 2.58314
H  2.958342 -0.665655 2.456676
H  2.760228 -1.897668 0.027068
H  2.356867 -1.576724 -1.653266
H  2.847105 2.65676 -1.385997
H  2.730463 2.65399 0.369922
H  4.306165 2.713297 -0.406349
H  3.679981 0.581598 -2.640202
H  5.167693 0.819647 -1.735314
H  4.402992 -0.754774 -1.738955
H  0.229993 0.526795 -1.127783
H  -0.193133 -1.796677 -2.313177
H  -1.295113 -3.673633 1.21406
C  -0.848946 0.800678 1.059418
C  -3.429078 1.033554 0.030624
C  -1.179751 1.834117 0.181183
C  -1.857604 -0.086431 1.43807
C  -3.139278 0.015729 0.925294
C  -2.460702 1.950791 -0.340593
H  -0.438531 2.574993 -0.088226
H  -1.636883 -0.87696 2.142916
H  -3.900718 -0.692581 1.222372
H  -2.695643 2.757648 -1.021417
Cl -5.030389 1.168837 -0.618556
H  0.501196 0.759082 2.749694
elementType: O N C H Cl
totalener: -1359.61667160 hartree
nucrepener: 2018.48374339 hartree
electener: -3378.10041500 hartree
oneelecener: -5868.13364774 hartree
twoeener: 2490.03323274 hartree
cpcmener: -0.02348944 hartree
kineticenergy: 1354.97362797 hartree
xcener: -109.831795158138 hartree
chargesum: -0.0000000
charge: -0.421062 0.130010 -0.332603 -0.389489 0.233895 0.625674 -0.249052 -0.356695 -0.110431 -0.235663 -0.360057 -0.354113 -0.029836 0.023979 0.033137 0.080656 0.087435 0.103691 0.094819 0.135366 0.142069 0.095969 0.102185 0.098725 0.104722 0.104769 0.091140 0.227196 0.180308 0.163330 -0.037603 0.120733 -0.193476 -0.192797 -0.157071 -0.173427 0.163573 0.145118 0.140007 0.144003 -0.100621 0.121485
qa: -0.4211 0.1300 -0.3326 -0.3895 0.2339 0.6257 -0.2491 -0.3567 -0.1104 -0.2357 -0.3601 -0.3541 -0.0298 0.0240 0.0331 0.0807 0.0874 0.1037 0.0948 0.1354 0.1421 0.0960 0.1022 0.0987 0.1047 0.1048 0.0911 0.2272 0.1803 0.1633 -0.0376 0.1207 -0.1935 -0.1928 -0.1571 -0.1734 0.1636 0.1451 0.1400 0.1440 -0.1006 0.1215
va: 2.0509 3.3681 2.8681 3.0237 3.7372 3.5534 3.9957 3.9080 3.8492 3.9621 3.9441 3.9088 3.7343 4.0604 4.0612 1.0169 1.0095 1.0050 1.0129 1.0072 0.9911 1.0146 0.9981 1.0060 1.0078 1.0022 1.0001 1.0438 0.9989 0.9961 3.5543 3.8183 3.9007 3.9464 4.0005 4.0400 1.0021 1.0067 1.0075 1.0076 1.2054 0.9995
dispcorr: -0.026514720 hartree
energy: -1359.643186324270
dipole: 38.99241 -36.89803 2.09438 3.48211 -3.09753 0.38458 1.16253 -0.83731 0.32522
magnitude: 2.15409 au
magnitude: 5.47527 debye
