program: Orca
programVersion: 4.2.1
elementType: O N N N C C C C C C C C C C C H H H H H H H H H H H H H H H C C C C C C H H H H Cl H
charge: 0
multiplicity: 1
keywords: wb97x-d3
keywords: def2-TZVPP
keywords: def2/J RIJCOSX GRIDX6 NOFINALGRIDX
keywords: grid4 nofinalgrid
keywords: scfconv7
keywords: smallprint printgap noloewdin
keywords: NOSOSCF
formula: C17H20ClN3O
InChI: InChI=1S/C17H20ClN3O/c1-16(2)8-7-14(9-13-3-5-15(18)6-4-13)17(16,22)10-21-12-19-11-20-21/h3-6,9,11-12,22H,7-8,10H2,1-2H3
42 atoms
O  0.804777 0.509137 -1.242453
N  1.091115 -2.357162 -0.735864
N  1.03768 -3.085674 0.380206
N  -0.667458 -3.60544 -0.972333
C  3.099856 0.87641 -0.349782
C  1.797766 0.008623 -0.395318
C  3.845463 0.283922 0.861762
C  1.460012 -0.049652 1.07898
C  2.75861 -0.27497 1.805824
C  2.135263 -1.386668 -0.946539
C  2.730003 2.336191 -0.072994
C  3.922331 0.822627 -1.630809
C  0.327222 0.272338 1.702668
C  0.069161 -2.674277 -1.533178
C  -0.030501 -3.819701 0.196171
H  4.461243 1.040385 1.350472
H  4.529394 -0.506303 0.544744
H  2.754368 0.21338 2.78036
H  2.909897 -1.341553 1.991573
H  3.041716 -1.790255 -0.499835
H  2.308099 -1.316038 -2.02036
H  2.133189 2.459617 0.833314
H  3.636675 2.929184 0.05859
H  2.17891 2.785596 -0.902059
H  4.798218 1.468561 -1.540083
H  4.293498 -0.177538 -1.859278
H  3.349241 1.174264 -2.49146
H  0.411342 1.298985 -0.857203
H  -0.093493 -2.21409 -2.495024
H  -0.35833 -4.542522 0.927425
C  -0.978181 0.666268 1.137036
C  -3.442715 1.517168 0.151296
C  -1.742211 -0.15745 0.313537
C  -1.49584 1.918823 1.474324
C  -2.715515 2.354428 0.982675
C  -2.968611 0.258671 -0.181561
H  -1.390619 -1.14822 0.065695
H  -0.929743 2.574315 2.125054
H  -3.08979 3.334677 1.245689
H  -3.547019 -0.396886 -0.818564
Cl -4.971399 2.047981 -0.469197
H  0.377844 0.338405 2.787281
elementType: O N C H Cl
totalener: -1359.61816858 hartree
nucrepener: 1995.17743931 hartree
electener: -3354.79560789 hartree
oneelecener: -5821.51812189 hartree
twoeener: 2466.72251400 hartree
cpcmener: -0.02416401 hartree
kineticenergy: 1354.97809283 hartree
xcener: -109.832753046238 hartree
chargesum: -0.0000000
charge: -0.401717 0.150918 -0.342483 -0.410962 0.215732 0.666785 -0.275824 -0.423037 -0.054096 -0.266637 -0.377995 -0.340401 -0.061169 0.034037 0.065753 0.082986 0.086953 0.092249 0.092637 0.152476 0.133086 0.114593 0.099823 0.097275 0.106273 0.089024 0.101453 0.223895 0.170056 0.158656 -0.029068 0.127661 -0.143441 -0.144345 -0.183503 -0.178609 0.128428 0.140364 0.143011 0.135913 -0.100738 0.123990
qa: -0.4017 0.1509 -0.3425 -0.4110 0.2157 0.6668 -0.2758 -0.4230 -0.0541 -0.2666 -0.3780 -0.3404 -0.0612 0.0340 0.0658 0.0830 0.0870 0.0922 0.0926 0.1525 0.1331 0.1146 0.0998 0.0973 0.1063 0.0890 0.1015 0.2239 0.1701 0.1587 -0.0291 0.1277 -0.1434 -0.1443 -0.1835 -0.1786 0.1284 0.1404 0.1430 0.1359 -0.1007 0.1240
va: 2.0596 3.3268 2.8654 2.9983 3.7812 3.4743 4.0089 3.9410 3.8157 3.9389 3.9303 3.8983 3.7533 4.0637 4.0209 1.0112 1.0103 1.0132 1.0259 0.9960 1.0035 0.9951 1.0075 1.0088 1.0025 1.0017 1.0104 1.0226 1.0017 0.9963 3.6228 3.7992 3.8983 3.9426 4.0032 4.0587 0.9995 1.0054 1.0060 1.0113 1.2053 1.0045
dispcorr: -0.025537958 hartree
energy: -1359.643706538514
dipole: 36.80570 -34.48460 2.32110 3.24598 -1.90356 1.34242 1.68308 -1.42140 0.26168
magnitude: 2.69409 au
magnitude: 6.84782 debye
