program: Orca
programVersion: 4.2.1
elementType: O N N N C C C C C C C C C C C H H H H H H H H H H H H H H H C C C C C C H H H H Cl H
charge: 0
multiplicity: 1
keywords: wb97x-d3
keywords: def2-TZVPP
keywords: def2/J RIJCOSX GRIDX6 NOFINALGRIDX
keywords: grid4 nofinalgrid
keywords: scfconv7
keywords: smallprint printgap noloewdin
keywords: NOSOSCF
formula: C17H20ClN3O
InChI: InChI=1S/C17H20ClN3O/c1-16(2)8-7-14(9-13-3-5-15(18)6-4-13)17(16,22)10-21-12-19-11-20-21/h3-6,9,11-12,22H,7-8,10H2,1-2H3
42 atoms
O  0.872463 0.391973 -1.306756
N  1.036851 -2.364951 -0.449625
N  0.961521 -3.007867 0.718541
N  -0.810235 -3.50325 -0.563406
C  3.179127 0.80721 -0.479283
C  1.848382 -0.0137 -0.395794
C  3.917268 0.374559 0.803374
C  1.523682 0.140596 1.074803
C  2.821617 -0.017615 1.818811
C  2.133661 -1.484836 -0.745503
C  2.854923 2.301803 -0.418945
C  3.986214 0.541845 -1.744676
C  0.393648 0.538579 1.653284
C  -0.028994 -2.666792 -1.201847
C  -0.159979 -3.678784 0.606333
H  4.555283 1.176032 1.178148
H  4.580609 -0.469432 0.602207
H  2.841178 0.596751 2.719139
H  2.936531 -1.053992 2.146709
H  3.002563 -1.867199 -0.21354
H  2.34363 -1.556169 -1.813243
H  2.307468 2.629873 -1.3036
H  2.269157 2.569498 0.46241
H  3.77977 2.879446 -0.380647
H  4.862262 1.191901 -1.777606
H  4.354147 -0.483213 -1.806131
H  3.395739 0.74502 -2.639813
H  0.349577 1.110306 -0.939426
H  -0.191875 -2.253454 -2.184526
H  -0.518075 -4.323728 1.393387
C  -0.916057 0.813742 1.022539
C  -3.395597 1.385942 -0.113438
C  -1.38509 2.125718 0.948251
C  -1.731094 -0.205078 0.537623
C  -2.962707 0.072304 -0.032473
C  -2.614084 2.41925 0.378964
H  -0.776394 2.933904 1.335639
H  -1.409883 -1.232675 0.617786
H  -3.579177 -0.732511 -0.408289
H  -2.961287 3.441533 0.319989
Cl -4.927844 1.741485 -0.827848
H  0.433813 0.727214 2.723796
totalener: -1359.59295784 hartree
nucrepener: 2003.94435400 hartree
electener: -3363.53731184 hartree
oneelecener: -5838.72545467 hartree
twoeener: 2475.18814283 hartree
kineticenergy: 1354.99112274 hartree
xcener: -109.833048840922 hartree
chargesum: -0.0000000
charge: -0.367600 0.141203 -0.302996 -0.338895 0.235391 0.647765 -0.289875 -0.391289 -0.072793 -0.296745 -0.368276 -0.333605 -0.019795 0.020923 0.059148 0.078126 0.083225 0.084631 0.098849 0.143826 0.125651 0.098999 0.103761 0.091522 0.098350 0.078091 0.108848 0.208672 0.145033 0.130158 -0.020988 0.124156 -0.170647 -0.157826 -0.166777 -0.152029 0.123675 0.145118 0.128987 0.122263 -0.079935 0.103700
qa: -0.3676 0.1412 -0.3030 -0.3389 0.2354 0.6478 -0.2899 -0.3913 -0.0728 -0.2967 -0.3683 -0.3336 -0.0198 0.0209 0.0591 0.0781 0.0832 0.0846 0.0988 0.1438 0.1257 0.0990 0.1038 0.0915 0.0984 0.0781 0.1088 0.2087 0.1450 0.1302 -0.0210 0.1242 -0.1706 -0.1578 -0.1668 -0.1520 0.1237 0.1451 0.1290 0.1223 -0.0799 0.1037
va: 2.1007 3.3172 2.8479 3.0254 3.7355 3.4738 4.0216 3.9074 3.8230 3.9922 3.9382 3.9074 3.7626 4.0887 4.0268 1.0143 1.0112 1.0139 1.0238 0.9991 1.0003 1.0124 0.9990 1.0109 1.0065 1.0023 1.0094 1.0498 1.0124 1.0031 3.7488 3.8859 3.9522 3.9634 4.0561 4.0240 1.0110 1.0051 1.0152 1.0136 1.2269 1.0056
dispcorr: -0.025927868 hartree
energy: -1359.618885703348
dipole: 37.06228 -35.49644 1.56583 3.75595 -2.81537 0.94058 1.65674 -1.46276 0.19398
magnitude: 1.83689 au
magnitude: 4.66899 debye
