program: Orca
programVersion: 4.2.1
elementType: Cl O O N N N C C C C C C C C C C C C C C H H H H H H H H H H H H H H H H H H
charge: 0
multiplicity: 1
keywords: wb97x-d3
keywords: def2-TZVPP
keywords: def2/J RIJCOSX GRIDX6 NOFINALGRIDX
keywords: grid4 nofinalgrid
keywords: scfconv7
keywords: smallprint printgap noloewdin
keywords: NOSOSCF
formula: C14H18ClN3O2
InChI: InChI=1S/C14H18ClN3O2/c1-14(2,3)12(19)13(18-9-16-8-17-18)20-11-6-4-10(15)5-7-11/h4-9,12-13,19H,1-3H3
38 atoms
Cl -5.415518 -0.578154 0.243082
O  3.071186 0.01485 -1.265851
O  0.388283 -0.443739 -0.545787
N  1.18088 1.642197 0.078487
N  1.341649 2.516343 1.075321
N  1.069418 3.586216 -0.876687
C  2.963672 -1.766999 0.376472
C  2.698113 -0.278449 0.059664
C  1.266787 0.208361 0.315108
C  2.376176 -2.121282 1.743347
C  2.412963 -2.726819 -0.6802
C  4.484926 -1.944017 0.441811
C  1.028992 2.290548 -1.078658
C  -0.949389 -0.417631 -0.296897
C  1.268563 3.663953 0.452395
C  -1.731316 -1.185298 -1.155473
C  -1.549666 0.30356 0.727938
C  -3.10287 -1.237359 -0.991966
C  -2.92818 0.249134 0.891368
C  -3.696383 -0.517195 0.035028
H  3.307461 0.298102 0.768471
H  1.008798 0.058603 1.367059
H  2.686281 -1.415857 2.518086
H  1.284909 -2.155007 1.735767
H  2.718652 -3.110245 2.05267
H  1.325359 -2.732484 -0.724982
H  2.728663 -3.744377 -0.441179
H  2.792875 -2.500899 -1.676782
H  4.737999 -2.981044 0.669614
H  4.927849 -1.319315 1.220868
H  4.96539 -1.690352 -0.503748
H  3.558613 0.843546 -1.279171
H  0.872677 1.80357 -2.027189
H  1.355668 4.599378 0.981785
H  -1.26335 -1.747301 -1.953299
H  -0.985821 0.918865 1.41484
H  -3.700081 -1.839151 -1.662909
H  -3.387512 0.814615 1.690236
elementType: Cl O N C H
totalener: -1319.32084799 hartree
nucrepener: 1731.33834376 hartree
electener: -3050.65919176 hartree
oneelecener: -5242.97530927 hartree
twoeener: 2192.31611751 hartree
cpcmener: -0.02970504 hartree
kineticenergy: 1314.95875819 hartree
xcener: -104.209820180277 hartree
chargesum: -0.0000000
charge: -0.104534 -0.431152 -0.309642 0.095843 -0.360099 -0.412512 0.236369 0.132952 0.097091 -0.364886 -0.343830 -0.340055 0.056256 0.337733 0.077766 -0.272839 -0.191515 -0.109267 -0.185955 0.075309 0.109197 0.161630 0.107977 0.093502 0.102333 0.095341 0.098790 0.097386 0.094698 0.097239 0.097070 0.240815 0.180853 0.165624 0.147542 0.132657 0.146784 0.147529
qa: -0.1045 -0.4312 -0.3096 0.0958 -0.3601 -0.4125 0.2364 0.1330 0.0971 -0.3649 -0.3438 -0.3401 0.0563 0.3377 0.0778 -0.2728 -0.1915 -0.1093 -0.1860 0.0753 0.1092 0.1616 0.1080 0.0935 0.1023 0.0953 0.0988 0.0974 0.0947 0.0972 0.0971 0.2408 0.1809 0.1656 0.1475 0.1327 0.1468 0.1475
va: 1.1991 2.0183 2.0701 3.3529 2.8803 3.0498 3.6828 3.9048 3.8873 3.9468 3.9416 3.9195 4.0888 3.6485 4.0292 4.0367 3.9426 3.9672 4.0408 3.8201 0.9972 0.9802 1.0033 1.0010 1.0051 1.0058 1.0044 1.0167 1.0067 1.0042 1.0167 0.9964 1.0046 0.9931 1.0066 1.0250 1.0024 1.0042
dispcorr: -0.020303271 hartree
energy: -1319.341151262088
dipole: 34.62295 -33.32598 1.29696 -14.06619 13.19816 -0.86803 3.65868 -3.01467 0.64401
magnitude: 1.68829 au
magnitude: 4.29130 debye
