program: Orca
programVersion: 4.2.1
elementType: Cl O O N N N C C C C C C C C C C C C C C H H H H H H H H H H H H H H H H H H
charge: 0
multiplicity: 1
keywords: wb97x-d3
keywords: def2-TZVPP
keywords: def2/J RIJCOSX GRIDX6 NOFINALGRIDX
keywords: grid4 nofinalgrid
keywords: scfconv7
keywords: smallprint printgap noloewdin
keywords: NOSOSCF
formula: C14H18ClN3O2
InChI: InChI=1S/C14H18ClN3O2/c1-14(2,3)12(19)13(18-9-16-8-17-18)20-11-6-4-10(15)5-7-11/h4-9,12-13,19H,1-3H3
38 atoms
Cl -5.684147 -0.100615 0.06742
O  1.977672 -2.335709 -0.892634
O  0.067315 -0.50852 -0.97645
N  1.216078 1.069069 0.279587
N  1.148009 1.553055 1.525026
N  1.546361 3.203435 0.060358
C  3.602489 -0.932272 0.304227
C  2.327105 -1.007996 -0.574108
C  1.05988 -0.342749 -0.000176
C  4.188355 0.484077 0.338518
C  3.340491 -1.40857 1.734738
C  4.657711 -1.841195 -0.339426
C  1.455408 2.063577 -0.580172
C  -1.247057 -0.387232 -0.649701
C  1.357891 2.83095 1.341896
C  -1.725513 -0.030155 0.605018
C  -2.143911 -0.651776 -1.682523
C  -3.095201 0.055455 0.821485
C  -3.506107 -0.566247 -1.465758
C  -3.976746 -0.211629 -0.209146
H  2.555854 -0.52339 -1.530506
H  0.780489 -0.817379 0.945866
H  5.201647 0.445814 0.741965
H  4.255738 0.919836 -0.660503
H  3.634039 1.169304 0.977234
H  2.673731 -0.740133 2.281306
H  4.278048 -1.448683 2.291432
H  2.91265 -2.413742 1.774113
H  4.382322 -2.894764 -0.315585
H  5.602292 -1.741958 0.197949
H  4.843171 -1.565865 -1.38057
H  1.924096 -2.852678 -0.080267
H  1.547623 1.924427 -1.645494
H  1.364397 3.525585 2.166715
H  -1.069295 0.194916 1.433451
H  -1.771136 -0.931271 -2.659258
H  -3.457709 0.336447 1.800571
H  -4.19188 -0.778926 -2.274289
elementType: Cl O N C H
totalener: -1319.31867314 hartree
nucrepener: 1726.83023303 hartree
electener: -3046.14890617 hartree
oneelecener: -5233.91603147 hartree
twoeener: 2187.76712530 hartree
cpcmener: -0.03226549 hartree
kineticenergy: 1314.93116290 hartree
xcener: -104.205774759944 hartree
chargesum: 0.0000000
charge: -0.106089 -0.426940 -0.309309 0.120544 -0.358941 -0.393994 0.186404 0.148518 0.058046 -0.363377 -0.341034 -0.320734 0.059515 0.339762 0.088173 -0.193988 -0.292559 -0.198228 -0.110557 0.081842 0.118980 0.162765 0.105584 0.109580 0.097468 0.091472 0.103684 0.095719 0.090766 0.096407 0.101469 0.228814 0.185262 0.163679 0.141220 0.147055 0.146522 0.146500
qa: -0.1061 -0.4269 -0.3093 0.1205 -0.3589 -0.3940 0.1864 0.1485 0.0580 -0.3634 -0.3410 -0.3207 0.0595 0.3398 0.0882 -0.1940 -0.2926 -0.1982 -0.1106 0.0818 0.1190 0.1628 0.1056 0.1096 0.0975 0.0915 0.1037 0.0957 0.0908 0.0964 0.1015 0.2288 0.1853 0.1637 0.1412 0.1471 0.1465 0.1465
va: 1.1978 2.0025 2.0712 3.2845 2.8323 3.0497 3.7416 3.9505 3.9584 3.9449 3.9452 3.9244 4.0726 3.7074 4.0038 3.8996 4.0489 4.0522 3.9633 3.8166 1.0074 0.9797 1.0099 1.0019 1.0031 1.0170 1.0050 1.0101 1.0185 1.0066 1.0031 1.0135 0.9951 0.9944 1.0287 1.0091 1.0059 1.0020
dispcorr: -0.020508290 hartree
energy: -1319.339181433326
dipole: 41.09537 -39.73874 1.35664 -7.60826 6.58767 -1.02059 3.78721 -3.38241 0.40480
magnitude: 1.74526 au
magnitude: 4.43609 debye
