program: Gaussian 09
title: 000030829
version: EM64L-G09RevD.01
frameworkgroup: C1[X(C8H19NO2)]
method: RPBEPBE
basis: SDD
operation: Freq
keyword: #p
keyword: freq=noraman
keyword: PBEPBE/SDD
title: #p freq=noraman PBEPBE/SDD
converged: YES YES NO NO
title: Mulliken charges:
elementType: O O N C C C C C C C C H H H H H H H H H H H H H H H H H H H
charge: -0.440191 -0.439948 -0.308943 -0.069978 -0.059264 -0.392781 -0.402067 -0.381334 -0.380112 -0.684423 -0.681226 0.196687 0.224728 0.192126 0.220671 0.167276 0.237562 0.247202 0.181514 0.236850 0.187042 0.197193 0.214056 0.228041 0.207697 0.211804 0.233297 0.212676 0.323037 0.320809
chargesum: 0.00000
title: Mulliken charges with hydrogens summed into heavy atoms:
elementType: O O N C C C C C C C C
charge: -0.117154 -0.119139 -0.061741 0.126709 0.165464 0.020016 0.002771 0.037031 0.004123 -0.034630 -0.023450
polarizability: 1.21906311e+02 3.02015907e-01 9.89543940e+01 -8.97968792e-01 -6.46816878e-01 8.74910569e+01
1716.lowfreq: -7.5215 -0.0004 0.0006 0.0007 5.1619 14.7372 31.8801 38.2551 61.2674
frequency: 31.6696 37.1243 61.2230 95.8008 104.2494 129.2361 165.7380 188.0474 205.3831 225.7817 240.3767 248.0263 258.1354 302.1291 310.5983 355.5602 419.0936 445.8591 467.0103 528.5418 541.1808 686.8534 759.9400 763.8090 819.7104 824.1773 921.5475 929.3982 949.4630 970.5129 1017.4346 1034.2465 1041.9987 1045.2790 1052.8048 1090.8317 1107.1465 1129.1665 1143.4994 1153.5795 1181.2517 1213.9307 1220.8038 1246.8373 1279.1011 1291.9865 1297.3729 1300.4901 1330.9819 1346.9104 1355.7699 1360.7295 1366.1561 1378.7849 1390.7982 1391.0553 1455.2617 1459.5884 1465.2829 1471.7756 1472.5393 1475.2298 1485.6969 1488.0453 1488.7160 2823.6119 2895.5084 2950.1293 2953.4441 2980.0125 2983.8851 2986.7154 3011.1648 3015.2561 3032.9567 3037.0176 3063.3913 3073.4233 3077.6326 3084.0215 3090.9927 3432.9445 3532.2426 3542.0248
redmass: 3.4104 3.9466 3.2963 2.0719 2.3010 2.5523 2.1731 1.5239 1.3592 1.8179 2.2555 2.8827 2.6121 1.1774 1.1534 3.7503 2.5080 2.2136 3.1434 3.4961 2.7702 1.2434 1.6719 1.6044 1.5648 1.6175 2.1677 2.3581 1.5572 1.4093 2.4875 2.9154 3.4505 1.5243 1.3992 1.6487 2.4402 2.1760 2.2141 3.1333 1.3240 1.4657 1.3823 1.3109 1.2018 1.2488 1.2551 1.2617 1.3294 1.4868 1.6363 1.2610 1.1862 1.4321 1.2059 1.2116 1.1388 1.1282 1.0731 1.0855 1.0421 1.0420 1.0841 1.0586 1.0557 1.0709 1.0669 1.0621 1.0666 1.0361 1.0364 1.0899 1.0951 1.0868 1.0864 1.0945 1.0892 1.0995 1.0993 1.0998 1.0999 1.0738 1.0656 1.0657
irintensity: 0.8919 2.7742 2.2942 0.1352 0.1277 4.8144 4.2378 4.1446 0.2586 1.0608 1.7500 0.6111 17.5834 122.3800 100.4765 53.0653 22.5498 4.2862 7.6552 0.9938 28.0602 82.3284 0.6532 0.6052 9.5776 11.5493 30.4495 82.2642 24.7583 14.8996 6.9798 1.9332 0.4342 56.9899 23.1323 59.8382 38.7666 7.1087 12.9031 20.0845 3.9502 24.8446 6.5940 2.2517 6.4956 9.6430 0.9660 2.3201 18.7468 11.5498 5.2470 25.6194 23.2811 1.2397 13.4003 14.0985 20.3644 20.3179 4.4609 3.8921 15.0806 12.6691 5.4441 14.7729 12.6596 119.4715 92.8305 37.6950 25.0755 35.1765 35.5765 11.2732 26.8554 52.0649 21.0888 17.6863 20.9626 56.5793 61.6568 35.5122 32.0528 0.9500 4.8437 5.0607
temp: 298.150 k
press: 1.00000 atm
elementType: 8 8 7 6 6 6 6 6 6 6 6 1 1 1 1 1 1 1 1 1 1 1 1 1 1 1 1 1 1 1
symmnumber: 1
zpe: 697325.0 jmol-1
zpe.correction: 0.265597 hartree
zpe.thermalcorrener: 0.280375 hartree
zpe.thermalcorrenthalpy: 0.281320 hartree
zpe.thermalcorrgfe: 0.223106 hartree
zpe.sumelectzpe: -520.476500 hartree
zpe.sumelectthermal: -520.461722 hartree
zpe.sumelectthermalent: -520.460778 hartree
zpe.sumelectthermalfe: -520.518991 hartree
dipole: 0.3640 -0.3676 -0.7678
dipole: 0.9258
quadrupole: -79.5552 -67.4755 -72.6380
quadrupole: -0.9466 -14.9097 -1.3011
quadrupole: -6.3323 5.7474 0.5849 -0.9466 -14.9097 -1.3011
hfenergy: -520.7420975 hartree
pointgroup: C01 [X(C8H19N1O2)]
dipole: -0.1434662 -0.1295969 0.3087158 debye
polarizability: 121.872255|-0.7575607|99.0081314|-1.1204261|0.2012756|87.4713759 unknown
InChI: InChI=1S/C8H19NO2/c1-3-7(10)5-9-6-8(11)4-2/h7-11H,3-6H2,1-2H3
charge 0 multiplicity 1
30 atoms
O  3.688418 -1.082061 0.728352
O  -3.540382 -0.959664 -0.885398
N  0.016146 -0.341429 0.25062
C  2.505558 -0.24389 0.426512
C  -2.399621 -0.145687 -0.404792
C  1.258672 -1.145424 0.261791
C  -1.215236 -1.085779 -0.083024
C  2.74978 0.67587 -0.78523
C  -2.818941 0.755031 0.776966
C  3.855647 1.722284 -0.537751
C  -3.963139 1.724659 0.413516
H  2.397401 0.367677 1.343602
H  -2.137253 0.478571 -1.276166
H  1.323163 -1.684577 -0.706155
H  1.287391 -1.915662 1.069437
H  -1.533683 -1.79984 0.723416
H  -1.018314 -1.693048 -0.985854
H  -0.085113 0.18788 1.127691
H  3.013247 0.042202 -1.660244
H  1.790946 1.168772 -1.034313
H  -3.120625 0.109003 1.63025
H  -1.939984 1.340821 1.114017
H  4.067706 2.305943 -1.452084
H  4.792098 1.234904 -0.212016
H  3.555144 2.433963 0.254034
H  -4.300919 2.297575 1.29608
H  -4.824898 1.169338 0.004013
H  -3.634902 2.447334 -0.356359
H  3.929509 -1.581625 -0.094049
H  -3.825615 -1.55704 -0.145763
