program: Orca
programVersion: 4.2.1
elementType: Cl O O N N N C C C C C C C C C C C C C C H H H H H H H H H H H H H H H H H H
charge: 0
multiplicity: 1
keywords: wb97x-d3
keywords: def2-TZVPP
keywords: def2/J RIJCOSX GRIDX6 NOFINALGRIDX
keywords: grid4 nofinalgrid
keywords: scfconv7
keywords: smallprint printgap noloewdin
keywords: NOSOSCF
formula: C14H18ClN3O2
InChI: InChI=1S/C14H18ClN3O2/c1-14(2,3)12(19)13(18-9-16-8-17-18)20-11-6-4-10(15)5-7-11/h4-9,12-13,19H,1-3H3
38 atoms
Cl -5.418916 -0.688081 0.529372
O  3.623651 0.673266 -0.16872
O  0.326957 -0.59835 -0.618185
N  1.102418 1.578118 -0.434368
N  1.431422 1.924261 -1.684578
N  0.556058 3.674187 -0.586181
C  3.076239 -1.494964 0.673061
C  2.660206 -0.34541 -0.271657
C  1.254956 0.222587 0.037394
C  4.378015 -2.094041 0.132589
C  3.312685 -0.991948 2.099178
C  2.023561 -2.605102 0.706282
C  0.579076 2.629019 0.201458
C  -0.992505 -0.553153 -0.288639
C  1.088396 3.184286 -1.723075
C  -1.492789 -0.06512 0.912332
C  -1.865939 -1.075904 -1.238158
C  -2.858427 -0.108212 1.161036
C  -3.225204 -1.122155 -0.989288
C  -3.716248 -0.634996 0.213299
H  2.624219 -0.74383 -1.294321
H  1.091471 0.261738 1.117081
H  4.70273 -2.923016 0.764342
H  4.244946 -2.486821 -0.878145
H  5.188873 -1.366553 0.105477
H  3.617996 -1.823705 2.736725
H  2.414012 -0.566009 2.550867
H  4.099931 -0.240271 2.15011
H  2.415642 -3.455107 1.267801
H  1.771752 -2.965319 -0.292405
H  1.098536 -2.305325 1.200928
H  3.594651 1.201061 -0.973894
H  0.247962 2.593732 1.227607
H  1.231626 3.780701 -2.61016
H  -0.856109 0.338766 1.686876
H  -1.477413 -1.452456 -2.175343
H  -3.236628 0.270603 2.100346
H  -3.892985 -1.532418 -1.734188
elementType: Cl O N C H
totalener: -1319.32023525 hartree
nucrepener: 1727.38799781 hartree
electener: -3046.70823306 hartree
oneelecener: -5235.04818648 hartree
twoeener: 2188.33995342 hartree
cpcmener: -0.03046762 hartree
kineticenergy: 1314.95478727 hartree
xcener: -104.208973065139 hartree
chargesum: 0.0000000
charge: -0.103944 -0.434402 -0.307048 0.142097 -0.395906 -0.412140 0.228099 0.128523 0.033196 -0.343089 -0.350056 -0.328542 0.092957 0.327050 0.088230 -0.190184 -0.271008 -0.177032 -0.110598 0.082883 0.104106 0.158714 0.097258 0.098199 0.096542 0.100071 0.093939 0.099927 0.101493 0.100441 0.082941 0.236771 0.177110 0.166230 0.145665 0.147634 0.146502 0.147367
qa: -0.1039 -0.4344 -0.3070 0.1421 -0.3959 -0.4121 0.2281 0.1285 0.0332 -0.3431 -0.3501 -0.3285 0.0930 0.3271 0.0882 -0.1902 -0.2710 -0.1770 -0.1106 0.0829 0.1041 0.1587 0.0973 0.0982 0.0965 0.1001 0.0939 0.0999 0.1015 0.1004 0.0829 0.2368 0.1771 0.1662 0.1457 0.1476 0.1465 0.1474
va: 1.1996 2.0045 2.0456 3.2855 2.8406 3.0341 3.6974 3.9429 3.9709 3.9115 3.9456 3.9513 4.0602 3.6565 4.0230 3.9246 4.0580 4.0413 3.9607 3.8177 1.0156 0.9640 1.0052 1.0037 1.0189 1.0027 1.0046 1.0176 1.0066 1.0100 1.0070 1.0144 0.9917 0.9915 1.0048 1.0083 1.0060 1.0016
dispcorr: -0.020042899 hartree
energy: -1319.340278151767
dipole: 34.75058 -34.19787 0.55271 -11.78350 10.87159 -0.91191 6.05602 -5.43752 0.61851
magnitude: 1.23272 au
magnitude: 3.13334 debye
