program: Orca
programVersion: 4.2.1
elementType: Cl O O N N N C C C C C C C C C C C C C C H H H H H H H H H H H H H H H H H H
charge: 0
multiplicity: 1
keywords: wb97x-d3
keywords: def2-TZVPP
keywords: def2/J RIJCOSX GRIDX6 NOFINALGRIDX
keywords: grid4 nofinalgrid
keywords: scfconv7
keywords: smallprint printgap noloewdin
keywords: NOSOSCF
formula: C14H18ClN3O2
InChI: InChI=1S/C14H18ClN3O2/c1-14(2,3)12(19)13(18-9-16-8-17-18)20-11-6-4-10(15)5-7-11/h4-9,12-13,19H,1-3H3
38 atoms
Cl -5.395254 -0.701441 0.730571
O  3.618247 0.602479 -0.130156
O  0.288727 -0.541922 -0.677103
N  1.157502 1.599702 -0.456256
N  1.076617 2.622243 0.398801
N  1.150564 3.367075 -1.715417
C  2.994023 -1.611707 0.532981
C  2.631277 -0.380942 -0.326694
C  1.244194 0.223947 -0.004648
C  1.924749 -2.702492 0.438819
C  4.305183 -2.186445 -0.01179
C  3.188058 -1.231825 2.002675
C  1.20782 2.057969 -1.709175
C  -1.014725 -0.515082 -0.289443
C  1.071485 3.65544 -0.401764
C  -1.540053 0.345057 0.66689
C  -1.843911 -1.434595 -0.926199
C  -2.89202 0.281493 0.980565
C  -3.189223 -1.494419 -0.615053
C  -3.708143 -0.632483 0.340697
H  2.604616 -0.69851 -1.378437
H  1.070887 0.253498 1.074753
H  1.694324 -2.966467 -0.594618
H  2.290792 -3.606016 0.930118
H  0.991698 -2.43345 0.935149
H  4.208992 -2.472588 -1.061945
H  4.585187 -3.082164 0.545875
H  5.130703 -1.479757 0.068646
H  3.991541 -0.508938 2.143281
H  3.447667 -2.120979 2.580309
H  2.282951 -0.819351 2.453967
H  3.733526 1.102489 -0.943232
H  1.277706 1.420433 -2.576756
H  1.006496 4.662708 -0.022303
H  -0.936303 1.081725 1.177929
H  -1.432859 -2.105884 -1.668819
H  -3.293745 0.955842 1.724146
H  -3.823767 -2.212971 -1.115115
elementType: Cl O N C H
totalener: -1319.31947927 hartree
nucrepener: 1725.70835611 hartree
electener: -3045.02783538 hartree
oneelecener: -5231.58510101 hartree
twoeener: 2186.55726563 hartree
cpcmener: -0.03071630 hartree
kineticenergy: 1314.95382211 hartree
xcener: -104.207007396683 hartree
chargesum: -0.0000000
charge: -0.105098 -0.418981 -0.302394 0.122168 -0.358834 -0.407896 0.224307 0.122176 0.047988 -0.327855 -0.341121 -0.349735 0.049441 0.328799 0.076128 -0.186611 -0.270324 -0.190986 -0.109766 0.081412 0.118233 0.160252 0.100506 0.100537 0.084551 0.098760 0.096971 0.096389 0.100399 0.100449 0.092361 0.233596 0.188809 0.166004 0.138828 0.146959 0.146329 0.147250
qa: -0.1051 -0.4190 -0.3024 0.1222 -0.3588 -0.4079 0.2243 0.1222 0.0480 -0.3279 -0.3411 -0.3497 0.0494 0.3288 0.0761 -0.1866 -0.2703 -0.1910 -0.1098 0.0814 0.1182 0.1603 0.1005 0.1005 0.0846 0.0988 0.0970 0.0964 0.1004 0.1004 0.0924 0.2336 0.1888 0.1660 0.1388 0.1470 0.1463 0.1472
va: 1.1986 2.0154 2.0515 3.3197 2.8699 3.0350 3.7174 3.9529 3.9098 3.9509 3.9140 3.9407 4.0815 3.6726 4.0311 3.9109 4.0393 4.0549 3.9620 3.8152 0.9951 0.9802 1.0101 1.0059 1.0047 1.0037 1.0051 1.0189 1.0170 1.0028 1.0066 1.0047 0.9912 0.9927 1.0294 1.0076 1.0056 1.0020
dispcorr: -0.020262613 hartree
energy: -1319.339741880922
dipole: 34.35055 -33.48248 0.86807 -13.09983 11.72003 -1.37979 2.97477 -3.55906 -0.58428
magnitude: 1.73169 au
magnitude: 4.40161 debye
