program: Orca
programVersion: 4.2.1
elementType: Cl O O N N N C C C C C C C C C C C C C C H H H H H H H H H H H H H H H H H H
charge: 0
multiplicity: 1
keywords: wb97x-d3
keywords: def2-TZVPP
keywords: def2/J RIJCOSX GRIDX6 NOFINALGRIDX
keywords: grid4 nofinalgrid
keywords: scfconv7
keywords: smallprint printgap noloewdin
keywords: NOSOSCF
formula: C14H18ClN3O2
InChI: InChI=1S/C14H18ClN3O2/c1-14(2,3)12(19)13(18-9-16-8-17-18)20-11-6-4-10(15)5-7-11/h4-9,12-13,19H,1-3H3
38 atoms
Cl -5.681348 -0.161945 0.442758
O  2.529301 -1.122054 -1.538943
O  0.028144 -0.998546 -0.578176
N  1.154234 1.00251 -0.169166
N  1.098357 1.940708 0.78581
N  1.376539 2.885204 -1.227668
C  3.582856 -0.866861 0.675166
C  2.320696 -1.213714 -0.150146
C  1.061722 -0.40529 0.163454
C  4.177832 0.504695 0.34876
C  3.26444 -0.953245 2.168796
C  4.636441 -1.934549 0.349289
C  1.318936 1.582756 -1.361809
C  -1.272746 -0.737941 -0.277868
C  1.241863 3.045839 0.103377
C  -2.206801 -1.349059 -1.11121
C  -1.705075 0.058844 0.775174
C  -3.560288 -1.17579 -0.892415
C  -3.066442 0.232494 0.993505
C  -3.985236 -0.382874 0.164216
H  2.04949 -2.242819 0.13123
H  0.865929 -0.453585 1.236729
H  3.57535 1.332153 0.723452
H  5.15805 0.596322 0.821005
H  4.323885 0.644114 -0.723253
H  4.179311 -0.849793 2.75431
H  2.816068 -1.914048 2.432935
H  2.587341 -0.164852 2.499975
H  4.256588 -2.945563 0.516709
H  5.512704 -1.803824 0.986186
H  4.992344 -1.873503 -0.682169
H  3.177234 -1.785528 -1.797138
H  1.377537 1.042242 -2.291041
H  1.242647 4.009971 0.586798
H  -1.870465 -1.96778 -1.933269
H  -1.019624 0.561803 1.442167
H  -4.273288 -1.658642 -1.546235
H  -3.393302 0.854365 1.815689
elementType: Cl O N C H
totalener: -1319.32017883 hartree
nucrepener: 1730.20007271 hartree
electener: -3049.52025154 hartree
oneelecener: -5241.21280393 hartree
twoeener: 2191.69255239 hartree
cpcmener: -0.02976668 hartree
kineticenergy: 1314.93874935 hartree
xcener: -104.208147420993 hartree
chargesum: -0.0000000
charge: -0.105850 -0.407495 -0.307026 0.115444 -0.358300 -0.399194 0.190379 0.123646 0.087296 -0.364463 -0.352305 -0.338924 0.077124 0.342120 0.085062 -0.291893 -0.202992 -0.105227 -0.184782 0.073448 0.116300 0.166224 0.098218 0.106868 0.101003 0.101598 0.108813 0.089175 0.108019 0.094728 0.094439 0.227055 0.171388 0.164547 0.146089 0.136009 0.146727 0.146732
qa: -0.1059 -0.4075 -0.3070 0.1154 -0.3583 -0.3992 0.1904 0.1236 0.0873 -0.3645 -0.3523 -0.3389 0.0771 0.3421 0.0851 -0.2919 -0.2030 -0.1052 -0.1848 0.0734 0.1163 0.1662 0.0982 0.1069 0.1010 0.1016 0.1088 0.0892 0.1080 0.0947 0.0944 0.2271 0.1714 0.1645 0.1461 0.1360 0.1467 0.1467
va: 1.1980 2.0212 2.0934 3.2918 2.8309 3.0527 3.7729 3.9512 3.9356 3.9318 3.9419 3.9107 4.0648 3.6948 4.0077 4.0464 3.9079 3.9558 4.0403 3.8234 1.0112 0.9752 1.0075 1.0074 1.0216 1.0050 1.0047 1.0103 1.0026 1.0063 1.0108 1.0134 1.0165 0.9937 1.0100 1.0311 1.0018 1.0054
dispcorr: -0.020411717 hartree
energy: -1319.340590550287
dipole: 41.25720 -39.58139 1.67581 -7.34647 5.41031 -1.93615 5.71906 -5.14048 0.57858
magnitude: 2.62522 au
magnitude: 6.67277 debye
