program: Orca
programVersion: 4.2.1
elementType: Cl O O N N N C C C C C C C C C C C C C C H H H H H H H H H H H H H H H H H H
charge: 0
multiplicity: 1
keywords: wb97x-d3
keywords: def2-TZVPP
keywords: def2/J RIJCOSX GRIDX6 NOFINALGRIDX
keywords: grid4 nofinalgrid
keywords: scfconv7
keywords: smallprint printgap noloewdin
keywords: NOSOSCF
formula: C14H18ClN3O2
InChI: InChI=1S/C14H18ClN3O2/c1-14(2,3)12(19)13(18-9-16-8-17-18)20-11-6-4-10(15)5-7-11/h4-9,12-13,19H,1-3H3
38 atoms
Cl -5.61906 -0.093932 0.552841
O  2.677883 -0.933482 -1.545725
O  0.065976 -0.989499 -0.546386
N  1.176151 1.043727 -0.3309
N  1.163789 2.048791 0.552147
N  1.164074 2.844701 -1.537458
C  3.582639 -0.921119 0.745865
C  2.37558 -1.154493 -0.192397
C  1.117029 -0.336798 0.113899
C  4.10301 0.514808 0.726026
C  3.199831 -1.313045 2.174224
C  4.706745 -1.854635 0.281064
C  1.169316 1.535279 -1.576711
C  -1.225694 -0.70856 -0.236506
C  1.165159 3.106638 -0.214356
C  -2.177718 -1.420966 -0.962426
C  -1.636876 0.202051 0.729592
C  -3.525921 -1.235714 -0.722521
C  -2.993084 0.386778 0.96941
C  -3.92919 -0.329266 0.247516
H  2.067179 -2.197706 -0.029143
H  0.952926 -0.299737 1.193176
H  3.418408 1.215457 1.203221
H  5.046718 0.572729 1.273062
H  4.297378 0.866916 -0.288475
H  4.072602 -1.260848 2.827471
H  2.816838 -2.335448 2.225748
H  2.445472 -0.654269 2.609066
H  4.376198 -2.894771 0.21592
H  5.537356 -1.824756 0.988517
H  5.113958 -1.566071 -0.68968
H  3.202265 -1.669297 -1.875278
H  1.156547 0.92342 -2.462691
H  1.162465 4.105267 0.193904
H  -1.858661 -2.127893 -1.717507
H  -0.93962 0.788265 1.311527
H  -4.253559 -1.797882 -1.291814
H  -3.302567 1.097261 1.723795
elementType: Cl O N C H
totalener: -1319.32835308 hartree
nucrepener: 1728.62854580 hartree
electener: -3047.95689888 hartree
oneelecener: -5238.02072975 hartree
twoeener: 2190.06383086 hartree
cpcmener: -0.02545235 hartree
kineticenergy: 1314.94343836 hartree
xcener: -104.208286796891 hartree
chargesum: -0.0000000
charge: -0.104139 -0.392668 -0.302506 0.110943 -0.359041 -0.397223 0.210833 0.121428 0.085499 -0.366633 -0.353731 -0.347156 0.081660 0.335643 0.088490 -0.288783 -0.195669 -0.104193 -0.187827 0.073991 0.108761 0.168425 0.098258 0.102703 0.100070 0.099354 0.104656 0.095267 0.108492 0.094278 0.095139 0.218827 0.166508 0.163735 0.142902 0.136126 0.144053 0.143526
qa: -0.1041 -0.3927 -0.3025 0.1109 -0.3590 -0.3972 0.2108 0.1214 0.0855 -0.3666 -0.3537 -0.3472 0.0817 0.3356 0.0885 -0.2888 -0.1957 -0.1042 -0.1878 0.0740 0.1088 0.1684 0.0983 0.1027 0.1001 0.0994 0.1047 0.0953 0.1085 0.0943 0.0951 0.2188 0.1665 0.1637 0.1429 0.1361 0.1441 0.1435
va: 1.1997 2.0307 2.0961 3.2836 2.8441 3.0628 3.6958 3.9491 3.9379 3.9272 3.9397 3.9100 4.0719 3.7079 4.0071 4.0470 3.8997 3.9615 4.0491 3.8346 1.0152 0.9794 1.0153 1.0069 1.0174 1.0044 1.0049 1.0049 1.0009 1.0074 1.0115 1.0175 1.0176 0.9935 1.0105 1.0320 1.0028 1.0065
dispcorr: -0.020186702 hartree
energy: -1319.348539785423
dipole: 40.69915 -39.15974 1.53941 -8.23967 6.24838 -1.99130 6.16310 -5.65975 0.50335
magnitude: 2.56679 au
magnitude: 6.52426 debye
