program: Orca
programVersion: 4.2.1
elementType: Cl O O N N N C C C C C C C C C C C C C C H H H H H H H H H H H H H H H H H H
charge: 0
multiplicity: 1
keywords: wb97x-d3
keywords: def2-TZVPP
keywords: def2/J RIJCOSX GRIDX6 NOFINALGRIDX
keywords: grid4 nofinalgrid
keywords: scfconv7
keywords: smallprint printgap noloewdin
keywords: NOSOSCF
formula: C14H18ClN3O2
InChI: InChI=1S/C14H18ClN3O2/c1-14(2,3)12(19)13(18-9-16-8-17-18)20-11-6-4-10(15)5-7-11/h4-9,12-13,19H,1-3H3
38 atoms
Cl -5.594122 -0.37206 0.589868
O  2.845142 -0.444437 -1.686333
O  0.091144 -0.86251 -0.733618
N  1.122824 1.152188 -0.193699
N  1.162972 1.998061 0.843535
N  1.030669 3.131627 -1.083547
C  3.554652 -1.027748 0.602111
C  2.427722 -0.966351 -0.455645
C  1.120149 -0.282237 0.010087
C  4.718358 -1.822057 -0.002092
C  4.059688 0.354079 1.025405
C  3.060383 -1.781553 1.840109
C  1.032091 1.848777 -1.340077
C  -1.204668 -0.682445 -0.363252
C  1.114454 3.170777 0.262164
C  -1.628269 0.086933 0.713321
C  -2.143273 -1.347941 -1.146827
C  -2.983826 0.17608 1.002718
C  -3.490115 -1.254891 -0.856362
C  -3.909336 -0.491419 0.223753
H  2.143036 -2.00415 -0.658388
H  0.968451 -0.425992 1.083496
H  5.144555 -1.33604 -0.879008
H  5.51769 -1.933279 0.732278
H  4.405517 -2.82421 -0.302598
H  4.896768 0.242561 1.716322
H  3.297821 0.946931 1.529832
H  4.439052 0.945336 0.186934
H  2.313885 -1.226448 2.409757
H  3.891865 -1.970817 2.520389
H  2.630466 -2.750625 1.577063
H  3.361479 0.352726 -1.533669
H  0.9537 1.389022 -2.311761
H  1.134638 4.08788 0.829463
H  -0.939279 0.643104 1.333545
H  -1.807197 -1.942844 -1.985762
H  -3.31011 0.778299 1.83911
H  -4.212824 -1.776019 -1.468593
totalener: -1319.30212529 hartree
nucrepener: 1727.36190910 hartree
electener: -3046.66403438 hartree
oneelecener: -5234.78147663 hartree
twoeener: 2188.11744225 hartree
kineticenergy: 1314.95418776 hartree
xcener: -104.206792125510 hartree
chargesum: -0.0000000
charge: -0.083900 -0.354322 -0.287878 0.093262 -0.341018 -0.318566 0.142246 0.151014 0.072712 -0.281075 -0.336079 -0.346473 0.012072 0.301879 0.089303 -0.153833 -0.253345 -0.180614 -0.086869 0.073536 0.091477 0.150026 0.093286 0.088167 0.089929 0.096357 0.114670 0.077029 0.095430 0.094591 0.103612 0.192565 0.174595 0.136521 0.120805 0.125337 0.122147 0.121405
qa: -0.0839 -0.3543 -0.2879 0.0933 -0.3410 -0.3186 0.1422 0.1510 0.0727 -0.2811 -0.3361 -0.3465 0.0121 0.3019 0.0893 -0.1538 -0.2533 -0.1806 -0.0869 0.0735 0.0915 0.1500 0.0933 0.0882 0.0899 0.0964 0.1147 0.0770 0.0954 0.0946 0.1036 0.1926 0.1746 0.1365 0.1208 0.1253 0.1221 0.1214
va: 1.2210 2.0777 2.0952 3.2725 2.8141 3.0752 3.8274 3.9853 3.8675 3.9205 3.9326 3.9258 4.0951 3.8048 4.0050 3.8987 4.0626 4.0883 3.9827 3.9315 1.0224 0.9925 1.0195 1.0086 1.0087 1.0098 1.0198 1.0145 1.0067 1.0081 1.0053 1.0487 1.0060 0.9989 1.0382 1.0152 1.0137 1.0102
dispcorr: -0.020301769 hartree
energy: -1319.322427058403
dipole: 40.29856 -39.16829 1.13026 -7.57325 6.82826 -0.74499 5.32695 -4.84489 0.48205
magnitude: 1.43697 au
magnitude: 3.65248 debye
