program: Orca
programVersion: 4.2.1
elementType: Cl O O N N N C C C C C C C C C C C C C C H H H H H H H H H H H H H H H H H H
charge: 0
multiplicity: 1
keywords: wb97x-d3
keywords: def2-TZVPP
keywords: def2/J RIJCOSX GRIDX6 NOFINALGRIDX
keywords: grid4 nofinalgrid
keywords: scfconv7
keywords: smallprint printgap noloewdin
keywords: NOSOSCF
formula: C14H18ClN3O2
InChI: InChI=1S/C14H18ClN3O2/c1-14(2,3)12(19)13(18-9-16-8-17-18)20-11-6-4-10(15)5-7-11/h4-9,12-13,19H,1-3H3
38 atoms
Cl -5.605905 0.21464 0.403104
O  2.563039 -1.316944 -1.514516
O  0.033467 -1.154046 -0.397423
N  1.105319 0.903015 -0.160315
N  1.426227 1.263859 -1.408438
N  0.969125 3.072607 -0.174002
C  3.648752 -0.802379 0.629502
C  2.372722 -1.247034 -0.136208
C  1.086203 -0.488079 0.233214
C  4.216024 0.537806 0.155494
C  3.379714 -0.739934 2.13522
C  4.704969 -1.884369 0.375025
C  0.829976 2.00087 0.560076
C  -1.249214 -0.781122 -0.15134
C  1.334657 2.570007 -1.3704
C  -2.155998 -0.995878 -1.183459
C  -1.697802 -0.254784 1.05359
C  -3.495045 -0.698284 -1.013445
C  -3.040345 0.053242 1.221587
C  -3.935098 -0.168083 0.190454
H  2.170585 -2.273135 0.199721
H  0.974588 -0.493309 1.321706
H  5.173462 0.722321 0.646216
H  4.403546 0.540852 -0.918135
H  3.576795 1.388438 0.39161
H  4.318224 -0.639517 2.682405
H  2.891315 -1.647438 2.50028
H  2.762842 0.115605 2.419961
H  4.377798 -2.858365 0.746595
H  5.637303 -1.635191 0.884959
H  4.92058 -1.989648 -0.687394
H  2.392281 -0.447596 -1.901938
H  0.540452 1.969927 1.599234
H  1.536861 3.180759 -2.235951
H  -1.800615 -1.4030 -2.120559
H  -1.030161 -0.095803 1.890108
H  -4.194195 -0.871197 -1.819978
H  -3.384459 0.46121 2.161753
totalener: -1319.30203762 hartree
nucrepener: 1738.14024546 hartree
electener: -3057.44228308 hartree
oneelecener: -5256.24313999 hartree
twoeener: 2198.80085691 hartree
kineticenergy: 1314.95992467 hartree
xcener: -104.211464489950 hartree
chargesum: -0.0000000
charge: -0.080673 -0.364555 -0.265268 0.142231 -0.340728 -0.315184 0.209667 0.125555 0.012424 -0.347306 -0.351728 -0.308483 0.050626 0.263676 0.089247 -0.197788 -0.185031 -0.089375 -0.136234 0.071786 0.088051 0.125439 0.095541 0.102030 0.091151 0.099718 0.102238 0.073700 0.083373 0.082642 0.112525 0.205157 0.137207 0.137098 0.131557 0.105938 0.123638 0.120138
qa: -0.0807 -0.3646 -0.2653 0.1422 -0.3407 -0.3152 0.2097 0.1256 0.0124 -0.3473 -0.3517 -0.3085 0.0506 0.2637 0.0892 -0.1978 -0.1850 -0.0894 -0.1362 0.0718 0.0881 0.1254 0.0955 0.1020 0.0912 0.0997 0.1022 0.0737 0.0834 0.0826 0.1125 0.2052 0.1372 0.1371 0.1316 0.1059 0.1236 0.1201
va: 1.2240 2.0815 2.1298 3.2341 2.8721 3.0778 3.7269 4.0032 4.0835 3.9602 3.9498 3.9111 4.0795 3.8504 4.0164 4.0376 3.9146 3.9712 4.0452 3.9398 1.0131 0.9778 1.0106 1.0191 0.9991 1.0124 1.0050 1.0008 1.0072 1.0085 1.0199 1.0745 1.0041 0.9999 1.0141 1.0120 1.0086 1.0144
dispcorr: -0.020792562 hartree
energy: -1319.322830179368
dipole: 40.69841 -40.16843 0.52998 -5.93493 5.77692 -0.15800 6.72637 -5.82606 0.90031
magnitude: 1.05660 au
magnitude: 2.68565 debye
