program: Orca
programVersion: 4.2.1
elementType: Cl O O N N N C C C C C C C C C C C C C C H H H H H H H H H H H H H H H H
charge: 0
multiplicity: 1
keywords: wb97x-d3
keywords: def2-TZVPP
keywords: def2/J RIJCOSX GRIDX6 NOFINALGRIDX
keywords: grid4 nofinalgrid
keywords: scfconv7
keywords: smallprint printgap noloewdin
keywords: NOSOSCF
formula: C14H16ClN3O2
InChI: InChI=1S/C14H16ClN3O2/c1-14(2,3)12(19)13(18-9-16-8-17-18)20-11-6-4-10(15)5-7-11/h4-9,13H,1-3H3
36 atoms
Cl 5.154394 -2.097975 0.093683
O  0.289446 1.156373 -0.150031
O  -1.05512 -0.609555 -1.600878
N  -1.830237 1.853436 0.238783
N  -2.215943 2.548109 1.315793
N  -3.136968 3.395468 -0.547468
C  -2.604229 -1.312586 0.096554
C  -1.518463 -0.437381 -0.502362
C  -0.946871 0.728667 0.345692
C  -1.920955 -2.239563 1.116698
C  -3.680564 -0.49073 0.812926
C  -3.245883 -2.152816 -1.00347
C  1.376092 0.34193 -0.052915
C  -2.386863 2.374121 -0.863017
C  2.490735 0.735434 -0.787356
C  1.433212 -0.799496 0.734614
C  -2.996458 3.453267 0.793879
C  3.653727 -0.010133 -0.739929
C  2.599785 -1.552101 0.77657
C  3.701002 -1.15658 0.040808
H  -0.903357 0.46734 1.406434
H  -1.137971 -2.844521 0.657936
H  -1.492714 -1.694916 1.960014
H  -2.666706 -2.921205 1.528014
H  -3.297048 0.060993 1.670745
H  -4.44111 -1.171999 1.196012
H  -4.181215 0.210652 0.143374
H  -4.030919 -2.774673 -0.572105
H  -2.530373 -2.817492 -1.486936
H  -3.705902 -1.530969 -1.772567
H  -2.218413 1.992076 -1.857585
H  2.446502 1.627639 -1.397932
H  0.601763 -1.127323 1.342566
H  -3.489133 4.192401 1.404812
H  4.51436 0.303625 -1.314371
H  2.633516 -2.440631 1.391413
elementType: Cl O N C H
totalener: -1318.10217321 hartree
nucrepener: 1690.42305308 hartree
electener: -3008.52522629 hartree
oneelecener: -5159.31197408 hartree
twoeener: 2150.78674779 hartree
cpcmener: -0.03045423 hartree
kineticenergy: 1313.82615648 hartree
xcener: -103.773713294924 hartree
chargesum: -0.0000000
charge: -0.103401 -0.313292 -0.364571 0.120888 -0.337069 -0.395860 0.276117 0.084926 0.168378 -0.379279 -0.340709 -0.307521 0.278879 0.068015 -0.247917 -0.182166 0.090120 -0.123732 -0.206138 0.095219 0.161223 0.126051 0.111055 0.115013 0.099957 0.110639 0.108310 0.103931 0.101280 0.108769 0.186384 0.148896 0.176141 0.168442 0.147846 0.145177
qa: -0.1034 -0.3133 -0.3646 0.1209 -0.3371 -0.3959 0.2761 0.0849 0.1684 -0.3793 -0.3407 -0.3075 0.2789 0.0680 -0.2479 -0.1822 0.0901 -0.1237 -0.2061 0.0952 0.1612 0.1261 0.1111 0.1150 0.1000 0.1106 0.1083 0.1039 0.1013 0.1088 0.1864 0.1489 0.1761 0.1684 0.1478 0.1452
va: 1.2000 2.0836 2.0867 3.3261 2.8629 3.0347 3.6008 3.9931 3.8743 3.9412 3.9571 3.9224 3.7346 4.0629 4.0245 3.8983 4.0141 3.9739 4.0726 3.8092 0.9874 0.9993 1.0004 1.0062 1.0142 1.0077 1.0035 1.0055 1.0087 1.0034 0.9971 1.0069 0.9900 0.9927 1.0014 1.0085
dispcorr: -0.019272310 hartree
energy: -1318.121445516060
dipole: -29.25922 28.23453 -1.02469 -7.08489 5.96193 -1.12297 3.74867 -2.62299 1.12569
magnitude: 1.89161 au
magnitude: 4.80810 debye
