program: Orca
programVersion: 4.2.1
elementType: Cl O O N N N C C C C C C C C C C C C C C H H H H H H H H H H H H H H H H
charge: 0
multiplicity: 1
keywords: wb97x-d3
keywords: def2-TZVPP
keywords: def2/J RIJCOSX GRIDX6 NOFINALGRIDX
keywords: grid4 nofinalgrid
keywords: scfconv7
keywords: smallprint printgap noloewdin
keywords: NOSOSCF
formula: C14H16ClN3O2
InChI: InChI=1S/C14H16ClN3O2/c1-14(2,3)12(19)13(18-9-16-8-17-18)20-11-6-4-10(15)5-7-11/h4-9,13H,1-3H3
36 atoms
Cl 5.175539 -2.062799 0.368781
O  0.323576 1.130324 -0.41076
O  -0.995054 -0.971525 -1.307703
N  -1.803795 1.862418 -0.065443
N  -2.315117 2.651484 0.888698
N  -3.146084 3.195408 -1.125327
C  -2.58089 -1.198442 0.476966
C  -1.448689 -0.526127 -0.284814
C  -0.872409 0.814005 0.237827
C  -2.583346 -0.840156 1.963807
C  -3.904264 -0.746364 -0.164348
C  -2.434995 -2.713955 0.319921
C  1.414413 0.349466 -0.172403
C  -2.312966 2.197811 -1.258739
C  1.483163 -0.614656 0.825784
C  2.513752 0.576849 -0.993962
C  -3.112307 3.426028 0.204261
C  2.645074 -1.356464 0.991522
C  3.671597 -0.160035 -0.825851
C  3.730245 -1.129087 0.165852
H  -0.758784 0.806062 1.323625
H  -1.64917 -1.116273 2.457591
H  -2.769224 0.218393 2.149394
H  -3.381882 -1.390904 2.461655
H  -4.724586 -1.309624 0.282517
H  -3.918475 -0.934247 -1.238684
H  -4.113221 0.311115 0.003197
H  -1.49834 -3.074844 0.748456
H  -2.474796 -3.027161 -0.722314
H  -3.250186 -3.211395 0.84605
H  -2.049205 1.706068 -2.182689
H  0.663032 -0.814984 1.503107
H  2.462324 1.329794 -1.769684
H  -3.69574 4.195518 0.684563
H  2.68566 -2.107215 1.768468
H  4.51918 0.021914 -1.472061
elementType: Cl O N C H
totalener: -1318.10125933 hartree
nucrepener: 1692.03540194 hartree
electener: -3010.13666127 hartree
oneelecener: -5162.57245533 hartree
twoeener: 2152.43579406 hartree
cpcmener: -0.02900298 hartree
kineticenergy: 1313.81416545 hartree
xcener: -103.770838678579 hartree
chargesum: -0.0000000
charge: -0.103284 -0.314331 -0.365051 0.127559 -0.338429 -0.392106 0.225513 0.081718 0.188875 -0.338986 -0.332560 -0.297229 0.291940 0.060770 -0.165527 -0.251629 0.091304 -0.205909 -0.120450 0.093471 0.157100 0.109948 0.100735 0.109002 0.110676 0.121807 0.102716 0.105236 0.100434 0.102501 0.188866 0.147392 0.147834 0.166894 0.146229 0.146971
qa: -0.1033 -0.3143 -0.3651 0.1276 -0.3384 -0.3921 0.2255 0.0817 0.1889 -0.3390 -0.3326 -0.2972 0.2919 0.0608 -0.1655 -0.2516 0.0913 -0.2059 -0.1204 0.0935 0.1571 0.1099 0.1007 0.1090 0.1107 0.1218 0.1027 0.1052 0.1004 0.1025 0.1889 0.1474 0.1478 0.1669 0.1462 0.1470
va: 1.2003 2.0907 2.0845 3.3090 2.8560 3.0276 3.6955 3.9770 3.8597 3.9335 3.9291 3.9186 3.7084 4.0647 3.8924 4.0301 4.0085 4.0678 3.9736 3.8113 0.9805 1.0024 1.0191 1.0046 1.0042 1.0033 1.0035 1.0036 1.0163 1.0051 0.9969 1.0070 1.0071 0.9931 1.0067 1.0017
dispcorr: -0.019377498 hartree
energy: -1318.120636829318
dipole: -29.52973 28.58471 -0.94503 -5.33836 4.67642 -0.66194 5.61356 -4.40765 1.20591
magnitude: 1.66897 au
magnitude: 4.24218 debye
