program: Orca
programVersion: 4.2.1
elementType: Cl O O N N N C C C C C C C C C C C C C C H H H H H H H H H H H H H H H H
charge: 0
multiplicity: 1
keywords: wb97x-d3
keywords: def2-TZVPP
keywords: def2/J RIJCOSX GRIDX6 NOFINALGRIDX
keywords: grid4 nofinalgrid
keywords: scfconv7
keywords: smallprint printgap noloewdin
keywords: NOSOSCF
formula: C14H16ClN3O2
InChI: InChI=1S/C14H16ClN3O2/c1-14(2,3)12(19)13(18-9-16-8-17-18)20-11-6-4-10(15)5-7-11/h4-9,13H,1-3H3
36 atoms
Cl 5.431641 -0.453734 0.459518
O  -0.294916 -0.396636 -0.774801
O  -3.216943 -0.011727 -1.234038
N  -1.336565 1.541124 0.009332
N  -1.399775 2.286504 1.118596
N  -1.479986 3.576923 -0.708176
C  -2.957466 -1.873962 0.263258
C  -2.565682 -0.563862 -0.387373
C  -1.260254 0.107304 0.094906
C  -3.532674 -1.504383 1.642286
C  -4.027571 -2.570149 -0.571714
C  -1.75407 -2.803882 0.443916
C  1.022361 -0.360087 -0.418882
C  -1.391574 2.323953 -1.075781
C  1.520027 0.323342 0.682145
C  1.88319 -1.067576 -1.250857
C  -1.485871 3.498031 0.63889
C  2.88256 0.288861 0.950569
C  3.239234 -1.096116 -0.984227
C  3.733362 -0.417337 0.120637
H  -1.051852 -0.129911 1.142351
H  -2.803527 -1.009009 2.286528
H  -4.404061 -0.853693 1.555979
H  -3.847063 -2.41426 2.156007
H  -4.927284 -1.964754 -0.679682
H  -4.317525 -3.504599 -0.089377
H  -3.663797 -2.815429 -1.570687
H  -1.289995 -3.065528 -0.507364
H  -2.091335 -3.730727 0.909874
H  -0.984058 -2.39167 1.098072
H  -1.348335 1.952816 -2.086828
H  0.888174 0.898679 1.345283
H  1.489645 -1.598256 -2.108261
H  -1.550257 4.361186 1.282668
H  3.265336 0.82328 1.80914
H  3.901825 -1.650035 -1.635105
elementType: Cl O N C H
totalener: -1318.11246905 hartree
nucrepener: 1682.09730737 hartree
electener: -3000.20977641 hartree
oneelecener: -5142.54118735 hartree
twoeener: 2142.33141094 hartree
cpcmener: -0.02372614 hartree
kineticenergy: 1313.81596279 hartree
xcener: -103.769277277962 hartree
chargesum: 0.0000000
charge: -0.099411 -0.296511 -0.367127 0.115292 -0.354604 -0.400891 0.200698 0.206636 0.072757 -0.310143 -0.307241 -0.308908 0.314502 0.082813 -0.172465 -0.260834 0.084636 -0.189329 -0.104964 0.080566 0.166692 0.102262 0.117216 0.103520 0.098938 0.101891 0.106474 0.109994 0.105129 0.088652 0.175448 0.138099 0.145175 0.164435 0.145403 0.145203
qa: -0.0994 -0.2965 -0.3671 0.1153 -0.3546 -0.4009 0.2007 0.2066 0.0728 -0.3101 -0.3072 -0.3089 0.3145 0.0828 -0.1725 -0.2608 0.0846 -0.1893 -0.1050 0.0806 0.1667 0.1023 0.1172 0.1035 0.0989 0.1019 0.1065 0.1100 0.1051 0.0887 0.1754 0.1381 0.1452 0.1644 0.1454 0.1452
va: 1.2041 2.0410 2.1187 3.3015 2.8589 3.0466 3.7519 3.9987 3.8874 3.9366 3.9273 3.9468 3.6913 4.0775 3.9101 4.0424 4.0253 4.0595 3.9631 3.8363 0.9781 1.0077 1.0048 1.0017 1.0112 1.0054 1.0044 1.0062 1.0051 1.0096 1.0041 1.0273 1.0087 0.9924 1.0061 1.0025
dispcorr: -0.018487422 hartree
energy: -1318.130956470939
dipole: -28.60184 28.39324 -0.20861 -15.16804 13.13672 -2.03132 4.11251 -3.28621 0.82630
magnitude: 2.20285 au
magnitude: 5.59919 debye
