program: Orca
programVersion: 4.2.1
elementType: Cl O O N N N C C C C C C C C C C C C C C H H H H H H H H H H H H H H H H
charge: 0
multiplicity: 1
keywords: wb97x-d3
keywords: def2-TZVPP
keywords: def2/J RIJCOSX GRIDX6 NOFINALGRIDX
keywords: grid4 nofinalgrid
keywords: scfconv7
keywords: smallprint printgap noloewdin
keywords: NOSOSCF
formula: C14H16ClN3O2
InChI: InChI=1S/C14H16ClN3O2/c1-14(2,3)12(19)13(18-9-16-8-17-18)20-11-6-4-10(15)5-7-11/h4-9,13H,1-3H3
36 atoms
Cl 5.413515 -0.769937 -0.142088
O  -0.380037 -0.3067 -0.869366
O  -3.299653 0.090092 -1.018764
N  -1.299157 1.554965 0.223441
N  -1.123489 2.170744 1.401998
N  -1.530894 3.665639 -0.217352
C  -2.969773 -1.812826 0.414101
C  -2.599403 -0.492702 -0.239346
C  -1.235183 0.123447 0.143993
C  -1.798769 -2.801037 0.361189
C  -3.320495 -1.504003 1.87942
C  -4.185169 -2.41508 -0.284819
C  0.962589 -0.360309 -0.633833
C  -1.546678 2.465686 -0.733931
C  1.704585 -1.08157 -1.562447
C  1.596683 0.24524 0.442892
C  -1.274463 3.431879 1.087622
C  3.072714 -1.205345 -1.415407
C  2.971176 0.112612 0.58972
C  3.704259 -0.609944 -0.332943
H  -0.906752 -0.211834 1.132396
H  -1.496565 -3.016349 -0.663706
H  -0.918374 -2.456865 0.905903
H  -2.103824 -3.742417 0.820018
H  -4.174394 -0.829612 1.952923
H  -2.492521 -1.056441 2.431809
H  -3.583494 -2.431244 2.390993
H  -4.465587 -3.347701 0.206659
H  -3.977641 -2.639412 -1.331151
H  -5.045881 -1.748842 -0.253361
H  -1.71985 2.213762 -1.766934
H  1.202153 -1.546873 -2.400096
H  1.058739 0.840855 1.168439
H  -1.191933 4.214934 1.824801
H  3.645929 -1.768857 -2.138263
H  3.465095 0.586168 1.426602
totalener: -1318.09004335 hartree
nucrepener: 1681.10720352 hartree
electener: -2999.19724687 hartree
oneelecener: -5140.47247223 hartree
twoeener: 2141.27522536 hartree
kineticenergy: 1313.82172567 hartree
xcener: -103.767024871907 hartree
chargesum: 0.0000000
charge: -0.079224 -0.280233 -0.299928 0.110182 -0.330398 -0.324875 0.161985 0.180921 0.055499 -0.298636 -0.306425 -0.278769 0.271339 0.075502 -0.225385 -0.150643 0.080704 -0.090506 -0.177407 0.079447 0.138614 0.108559 0.082989 0.098297 0.115069 0.099575 0.095663 0.091765 0.099455 0.103186 0.151538 0.124813 0.135870 0.134810 0.122759 0.123891
qa: -0.0792 -0.2802 -0.2999 0.1102 -0.3304 -0.3249 0.1620 0.1809 0.0555 -0.2986 -0.3064 -0.2788 0.2713 0.0755 -0.2254 -0.1506 0.0807 -0.0905 -0.1774 0.0794 0.1386 0.1086 0.0830 0.0983 0.1151 0.0996 0.0957 0.0918 0.0995 0.1032 0.1515 0.1248 0.1359 0.1348 0.1228 0.1239
va: 1.2253 2.0570 2.1687 3.2808 2.8338 3.0675 3.8076 4.0007 3.9537 3.9498 3.9388 3.9370 3.8090 4.0835 4.0527 3.8910 4.0339 3.9886 4.0853 3.9258 0.9980 1.0078 1.0117 1.0072 1.0066 1.0092 1.0030 1.0058 1.0089 1.0133 1.0122 1.0150 1.0355 0.9986 1.0099 1.0142
dispcorr: -0.018453822 hartree
energy: -1318.108497168229
dipole: -28.44367 28.17375 -0.26992 -14.11189 12.59623 -1.51566 6.14002 -5.66814 0.47188
magnitude: 1.61020 au
magnitude: 4.09280 debye
