program: Orca
programVersion: 4.2.1
elementType: Cl Cl F F F F O N N N C C C C C C C C C C C C C H H H H H H H H H H H
charge: 0
multiplicity: 1
keywords: wb97x-d3
keywords: def2-TZVPP
keywords: def2/J RIJCOSX GRIDX6 NOFINALGRIDX
keywords: grid4 nofinalgrid
keywords: scfconv7
keywords: smallprint printgap noloewdin
keywords: NOSOSCF
formula: C13H11Cl2F4N3O
InChI: InChI=1S/C13H11Cl2F4N3O/c14-9-1-2-10(11(15)3-9)8(4-22-7-20-6-21-22)5-23-13(18,19)12(16)17/h1-3,6-8,12H,4-5H2
34 atoms
Cl -1.018207 0.802206 -2.897039
Cl -3.174149 3.473824 1.196632
F  4.160394 -1.19616 -0.033737
F  3.071841 -0.072782 -1.519767
F  4.153257 0.986634 1.644328
F  3.046443 2.124504 0.143397
O  2.133209 -0.417761 0.483536
N  -1.555633 -2.701524 -0.016704
N  -1.084193 -3.469348 0.970673
N  -3.15174 -2.748317 1.45927
C  0.188475 -1.112257 -0.817853
C  -0.736603 -2.298557 -1.1339
C  1.318221 -1.539162 0.111086
C  -0.613985 0.059281 -0.311488
C  -1.216162 0.966498 -1.18148
C  -0.857856 0.242052 1.047948
C  3.264378 -0.184402 -0.179202
C  -2.000944 2.019042 -0.736233
C  -1.640386 1.278223 1.526805
C  -2.777617 -2.270644 0.297475
C  -2.201896 2.164944 0.624501
C  3.915092 1.104592 0.319178
C  -2.075857 -3.468287 1.8244
H  0.636233 -0.849457 -1.777244
H  -1.405528 -2.029301 -1.949612
H  -0.156173 -3.157446 -1.468353
H  0.954259 -1.954291 1.04829
H  1.905059 -2.323075 -0.371542
H  -0.433294 -0.440686 1.772321
H  -2.446176 2.707895 -1.440296
H  -1.805408 1.387175 2.589361
H  -3.36035 -1.634284 -0.349726
H  4.847251 1.322323 -0.203181
H  -2.022418 -4.02024 2.749357
elementType: Cl F O N C H
totalener: -2061.43127200 hartree
nucrepener: 2385.21971496 hartree
electener: -4446.65098696 hartree
oneelecener: -7582.50257121 hartree
twoeener: 3135.85158424 hartree
cpcmener: -0.03016034 hartree
kineticenergy: 2055.88157114 hartree
xcener: -143.925074235814 hartree
chargesum: -0.0000000
charge: -0.081158 -0.085635 -0.200867 -0.204226 -0.200317 -0.199307 -0.300949 0.130703 -0.374408 -0.406662 0.081584 -0.120313 -0.049161 0.021903 -0.017458 -0.171824 0.449714 -0.119694 -0.150674 0.051285 0.090717 0.283508 0.079773 0.082606 0.136065 0.134486 0.125296 0.134539 0.146027 0.125044 0.147742 0.171104 0.127665 0.162892
qa: -0.0812 -0.0856 -0.2009 -0.2042 -0.2003 -0.1993 -0.3009 0.1307 -0.3744 -0.4067 0.0816 -0.1203 -0.0492 0.0219 -0.0175 -0.1718 0.4497 -0.1197 -0.1507 0.0513 0.0907 0.2835 0.0798 0.0826 0.1361 0.1345 0.1253 0.1345 0.1460 0.1250 0.1477 0.1711 0.1277 0.1629
va: 1.2481 1.2178 1.0981 1.0933 1.0852 1.0875 2.0860 3.3233 2.8638 3.0182 3.7779 3.9092 3.8786 3.4303 3.9797 3.9016 4.3491 4.0584 4.0595 4.0734 3.8673 4.1358 4.0261 1.0517 1.0041 1.0093 1.0229 1.0071 0.9994 1.0201 1.0039 0.9938 0.9820 0.9948
dispcorr: -0.019886415 hartree
energy: -2061.451158416354
dipole: -10.93435 11.56989 0.63554 -17.89213 17.36037 -0.53177 2.61592 -4.00675 -1.39083
magnitude: 1.61897 au
magnitude: 4.11511 debye
