program: Orca
programVersion: 4.2.1
elementType: Cl Cl F F F F O N N N C C C C C C C C C C C C C H H H H H H H H H H H
charge: 0
multiplicity: 1
keywords: wb97x-d3
keywords: def2-TZVPP
keywords: def2/J RIJCOSX GRIDX6 NOFINALGRIDX
keywords: grid4 nofinalgrid
keywords: scfconv7
keywords: smallprint printgap noloewdin
keywords: NOSOSCF
formula: C13H11Cl2F4N3O
InChI: InChI=1S/C13H11Cl2F4N3O/c14-9-1-2-10(11(15)3-9)8(4-22-7-20-6-21-22)5-23-13(18,19)12(16)17/h1-3,6-8,12H,4-5H2
34 atoms
Cl -0.990012 -0.470767 -2.071185
Cl -2.949301 3.708709 0.613254
F  4.124312 -0.88632 0.102828
F  2.444168 -0.385803 -1.151773
F  2.61121 2.239654 -0.380868
F  4.442396 1.427482 -1.25117
O  2.283875 -0.056412 1.058963
N  -1.719596 -2.83883 0.490452
N  -1.635706 -3.660152 -0.558694
N  -3.675637 -2.731524 -0.450849
C  0.262324 -1.395662 0.624734
C  -0.56023 -2.509708 1.283104
C  1.581274 -1.261742 1.383174
C  -0.523063 -0.109938 0.586824
C  -1.123545 0.38118 -0.568461
C  -0.723527 0.618874 1.757845
C  3.08236 -0.023468 -0.01161
C  -1.867786 1.553153 -0.57605
C  -1.463566 1.786162 1.787533
C  -2.930559 -2.283452 0.530232
C  -2.026057 2.247183 0.608457
C  3.639504 1.390931 -0.163602
C  -2.828647 -3.56332 -1.083695
H  0.484295 -1.723565 -0.389546
H  0.037908 -3.413072 1.396384
H  -0.89999 -2.21454 2.275558
H  1.416296 -1.199526 2.458418
H  2.199284 -2.144171 1.206607
H  -0.293349 0.266908 2.687196
H  -2.31647 1.911078 -1.492048
H  -1.595773 2.324771 2.715171
H  -3.231305 -1.58703 1.296967
H  4.199478 1.708737 0.715733
H  -3.104688 -4.127269 -1.960628
elementType: Cl F O N C H
totalener: -2061.43235942 hartree
nucrepener: 2415.31082228 hartree
electener: -4476.74318170 hartree
oneelecener: -7643.00480702 hartree
twoeener: 3166.26162533 hartree
cpcmener: -0.03812446 hartree
kineticenergy: 2055.88882290 hartree
xcener: -143.925585156040 hartree
chargesum: -0.0000000
charge: -0.083329 -0.087305 -0.199244 -0.198159 -0.198433 -0.201328 -0.307491 0.118370 -0.346197 -0.405622 0.068543 -0.108661 -0.047727 -0.004585 0.026490 -0.167561 0.468320 -0.113808 -0.166949 0.042895 0.094919 0.276326 0.055424 0.080715 0.128999 0.136153 0.123114 0.137499 0.144492 0.124821 0.147874 0.175992 0.124532 0.160923
qa: -0.0833 -0.0873 -0.1992 -0.1982 -0.1984 -0.2013 -0.3075 0.1184 -0.3462 -0.4056 0.0685 -0.1087 -0.0477 -0.0046 0.0265 -0.1676 0.4683 -0.1138 -0.1669 0.0429 0.0949 0.2763 0.0554 0.0807 0.1290 0.1362 0.1231 0.1375 0.1445 0.1248 0.1479 0.1760 0.1245 0.1609
va: 1.2389 1.2160 1.1013 1.0982 1.0857 1.0842 2.0628 3.3548 2.8771 3.0129 3.7324 3.9070 3.9206 3.3970 3.9154 3.9863 4.3102 4.0467 4.0449 4.0767 3.8567 4.1276 4.0584 1.0657 1.0109 0.9985 0.9969 1.0039 1.0006 1.0202 1.0038 0.9928 0.9840 0.9960
dispcorr: -0.020291426 hartree
energy: -2061.452650845122
dipole: -10.12593 11.23758 1.11165 -15.98970 15.75495 -0.23474 14.77396 -11.57867 3.19529
magnitude: 3.39128 au
magnitude: 8.61995 debye
