program: Orca
programVersion: 4.2.1
elementType: Cl Cl F F F F O N N N C C C C C C C C C C C C C H H H H H H H H H H H
charge: 0
multiplicity: 1
keywords: wb97x-d3
keywords: def2-TZVPP
keywords: def2/J RIJCOSX GRIDX6 NOFINALGRIDX
keywords: grid4 nofinalgrid
keywords: scfconv7
keywords: smallprint printgap noloewdin
keywords: NOSOSCF
formula: C13H11Cl2F4N3O
InChI: InChI=1S/C13H11Cl2F4N3O/c14-9-1-2-10(11(15)3-9)8(4-22-7-20-6-21-22)5-23-13(18,19)12(16)17/h1-3,6-8,12H,4-5H2
34 atoms
Cl -1.059607 -0.430549 -2.055395
Cl -3.20588 3.636228 0.654043
F  3.382658 -0.934745 -0.624162
F  1.981544 0.658941 -1.01299
F  4.533874 1.449448 -1.25303
F  4.992515 0.772501 0.771677
O  2.362971 0.053646 1.106873
N  -1.633881 -2.771486 0.426925
N  -1.545091 -3.563667 -0.643941
N  -3.616352 -2.718465 -0.46172
C  0.310386 -1.264196 0.604988
C  -0.476256 -2.433421 1.216303
C  1.597772 -1.116847 1.410871
C  -0.536444 -0.017319 0.583969
C  -1.205845 0.422076 -0.555749
C  -0.739813 0.714648 1.751786
C  2.896567 0.21822 -0.110998
C  -2.025967 1.541067 -0.549065
C  -1.551733 1.834169 1.794108
C  -2.864852 -2.266999 0.512571
C  -2.1875 2.23988 0.632838
C  4.011664 1.259697 -0.020646
C  -2.754742 -3.502753 -1.135053
H  0.57094 -1.554978 -0.413579
H  0.152155 -3.320299 1.287363
H  -0.813689 -2.187932 2.223179
H  1.390214 -1.021143 2.475718
H  2.209091 -2.012605 1.287212
H  -0.258546 0.405655 2.670785
H  -2.528775 1.856184 -1.452581
H  -1.682692 2.377334 2.719163
H  -3.172193 -1.601985 1.304413
H  3.656214 2.210136 0.377552
H  -3.030859 -4.05321 -2.020525
elementType: Cl F O N C H
totalener: -2061.43106622 hartree
nucrepener: 2407.22966189 hartree
electener: -4468.66072811 hartree
oneelecener: -7626.52134566 hartree
twoeener: 3157.86061754 hartree
cpcmener: -0.03683594 hartree
kineticenergy: 2055.88494656 hartree
xcener: -143.926563727022 hartree
chargesum: 0.0000000
charge: -0.082214 -0.086746 -0.197578 -0.197459 -0.200867 -0.201257 -0.314927 0.114413 -0.343162 -0.403753 0.043216 -0.108828 -0.037333 -0.027413 0.032868 -0.150101 0.467345 -0.111080 -0.175545 0.042745 0.100282 0.287432 0.054896 0.089496 0.127064 0.139703 0.121114 0.136447 0.145238 0.124911 0.147647 0.176892 0.126294 0.160259
qa: -0.0822 -0.0867 -0.1976 -0.1975 -0.2009 -0.2013 -0.3149 0.1144 -0.3432 -0.4038 0.0432 -0.1088 -0.0373 -0.0274 0.0329 -0.1501 0.4673 -0.1111 -0.1755 0.0427 0.1003 0.2874 0.0549 0.0895 0.1271 0.1397 0.1211 0.1364 0.1452 0.1249 0.1476 0.1769 0.1263 0.1603
va: 1.2416 1.2164 1.1054 1.0983 1.0842 1.0827 2.0626 3.3595 2.8753 3.0130 3.7276 3.9042 3.9272 3.3851 3.9015 3.9722 4.2677 4.0446 4.0561 4.0761 3.8523 4.1460 4.0594 1.0650 1.0136 0.9976 0.9971 1.0018 1.0004 1.0206 1.0045 0.9922 0.9830 0.9964
dispcorr: -0.020358234 hartree
energy: -2061.451424458705
dipole: -11.41172 11.91801 0.50629 -14.37120 14.57528 0.20408 13.64176 -10.81220 2.82956
magnitude: 2.88174 au
magnitude: 7.32479 debye
