program: Orca
programVersion: 4.2.1
elementType: Cl Cl F F F F O N N N C C C C C C C C C C C C C H H H H H H H H H H H
charge: 0
multiplicity: 1
keywords: wb97x-d3
keywords: def2-TZVPP
keywords: def2/J RIJCOSX GRIDX6 NOFINALGRIDX
keywords: grid4 nofinalgrid
keywords: scfconv7
keywords: smallprint printgap noloewdin
keywords: NOSOSCF
formula: C13H11Cl2F4N3O
InChI: InChI=1S/C13H11Cl2F4N3O/c14-9-1-2-10(11(15)3-9)8(4-22-7-20-6-21-22)5-23-13(18,19)12(16)17/h1-3,6-8,12H,4-5H2
34 atoms
Cl -2.531881 0.139858 -2.398671
Cl -4.263689 4.72044 -0.261654
F  3.630674 0.458902 0.913097
F  2.69881 -1.02273 2.174176
F  4.981936 -1.865049 0.960208
F  4.104147 -1.494219 -1.004398
O  1.823895 -0.613576 0.157257
N  -0.40127 -2.353245 0.482194
N  -0.15498 -2.954224 -0.681086
N  0.905739 -4.011594 0.988148
C  -0.443073 0.04988 -0.154376
C  -1.149454 -1.120425 0.546588
C  0.884603 0.41994 0.492957
C  -1.390104 1.224223 -0.182288
C  -2.375952 1.344151 -1.162599
C  -1.346307 2.224846 0.78597
C  2.945255 -0.708933 0.874091
C  -3.2640 2.406892 -1.198369
C  -2.216427 3.302748 0.776786
C  0.245565 -2.981536 1.461701
C  -3.169556 3.383773 -0.222438
C  3.817936 -1.812899 0.277217
C  0.630002 -3.938281 -0.327668
H  -0.23115 -0.240628 -1.186432
H  -1.312122 -0.890531 1.599553
H  -2.127892 -1.291712 0.100611
H  1.242436 1.370877 0.094898
H  0.786065 0.511347 1.576933
H  -0.612478 2.179767 1.57965
H  -4.012837 2.469467 -1.975534
H  -2.145659 4.064049 1.540903
H  0.191506 -2.672839 2.493179
H  3.33032 -2.787464 0.313448
H  1.011627 -4.64424 -1.048454
elementType: Cl F O N C H
totalener: -2061.43142839 hartree
nucrepener: 2332.50888486 hartree
electener: -4393.94031325 hartree
oneelecener: -7476.46759503 hartree
twoeener: 3082.52728178 hartree
cpcmener: -0.03136328 hartree
kineticenergy: 2055.87154984 hartree
xcener: -143.922322256023 hartree
chargesum: 0.0000000
charge: -0.080284 -0.085868 -0.195224 -0.204873 -0.198971 -0.199242 -0.291108 0.125943 -0.335218 -0.426167 0.127473 -0.104348 -0.093786 0.017552 -0.034415 -0.151927 0.449136 -0.128586 -0.168651 0.043144 0.096850 0.287923 0.053261 0.080088 0.130944 0.134499 0.150721 0.126840 0.144216 0.125715 0.147171 0.176705 0.117878 0.162610
qa: -0.0803 -0.0859 -0.1952 -0.2049 -0.1990 -0.1992 -0.2911 0.1259 -0.3352 -0.4262 0.1275 -0.1043 -0.0938 0.0176 -0.0344 -0.1519 0.4491 -0.1286 -0.1687 0.0431 0.0969 0.2879 0.0533 0.0801 0.1309 0.1345 0.1507 0.1268 0.1442 0.1257 0.1472 0.1767 0.1179 0.1626
va: 1.2474 1.2176 1.1099 1.0838 1.0896 1.0840 2.0733 3.3520 2.8693 2.9759 3.6503 3.8378 3.9041 3.5636 4.0146 3.9556 4.3280 4.0594 4.0452 4.0593 3.8566 4.1398 4.0308 1.0578 1.0071 1.0122 0.9962 0.9994 1.0026 1.0195 1.0055 0.9958 0.9941 0.9973
dispcorr: -0.019272903 hartree
energy: -2061.450701290073
dipole: -8.77394 7.25334 -1.52060 -4.77278 6.03557 1.26279 5.46997 -4.24352 1.22645
magnitude: 2.32617 au
magnitude: 5.91264 debye
