program: Orca
programVersion: 4.2.1
elementType: Cl Cl F F F F O N N N C C C C C C C C C C C C C H H H H H H H H H H H
charge: 0
multiplicity: 1
keywords: wb97x-d3
keywords: def2-TZVPP
keywords: def2/J RIJCOSX GRIDX6 NOFINALGRIDX
keywords: grid4 nofinalgrid
keywords: scfconv7
keywords: smallprint printgap noloewdin
keywords: NOSOSCF
formula: C13H11Cl2F4N3O
InChI: InChI=1S/C13H11Cl2F4N3O/c14-9-1-2-10(11(15)3-9)8(4-22-7-20-6-21-22)5-23-13(18,19)12(16)17/h1-3,6-8,12H,4-5H2
34 atoms
Cl -1.383483 -0.186108 -2.276434
Cl -4.813329 3.015483 0.268991
F  3.159064 0.428695 -1.405353
F  4.148876 1.616095 0.10144
F  4.345817 -1.840673 -0.44809
F  5.318005 -0.680882 1.127023
O  2.729109 0.025468 0.752178
N  -0.94173 -2.140074 0.789352
N  -2.139349 -2.005224 1.364803
N  -2.251432 -3.447017 -0.351482
C  0.352647 -0.095064 0.306893
C  0.194108 -1.340813 1.187748
C  1.503505 0.774957 0.802199
C  -0.929657 0.695954 0.26329
C  -1.777012 0.70563 -0.841947
C  -1.34315 1.421828 1.378404
C  3.65462 0.375044 -0.142618
C  -2.970499 1.412173 -0.853834
C  -2.524646 2.140496 1.398884
C  -1.029293 -2.988088 -0.234792
C  -3.330319 2.127966 0.273096
C  4.816779 -0.615761 -0.126031
C  -2.883486 -2.807266 0.649583
H  0.602752 -0.423527 -0.703313
H  1.084647 -1.964887 1.131171
H  0.050864 -1.067062 2.23223
H  1.561024 1.691316 0.213503
H  1.373863 1.062797 1.845185
H  -0.733344 1.427365 2.272585
H  -3.605717 1.400154 -1.728374
H  -2.809176 2.695118 2.281733
H  -0.18497 -3.252519 -0.851796
H  5.606416 -0.332704 -0.822701
H  -3.931356 -2.943561 0.866238
elementType: Cl F O N C H
totalener: -2061.43084340 hartree
nucrepener: 2342.14532363 hartree
electener: -4403.57616704 hartree
oneelecener: -7496.20788371 hartree
twoeener: 3092.63171667 hartree
cpcmener: -0.03262742 hartree
kineticenergy: 2055.88494197 hartree
xcener: -143.923255210725 hartree
chargesum: -0.0000000
charge: -0.084643 -0.086334 -0.202152 -0.200408 -0.201241 -0.199671 -0.312627 0.115935 -0.339159 -0.407703 0.080288 -0.093202 -0.039531 0.012837 0.003654 -0.180418 0.451344 -0.125726 -0.167253 0.038626 0.099919 0.285890 0.056459 0.077757 0.132549 0.123711 0.138285 0.132911 0.143408 0.124808 0.148994 0.181379 0.130012 0.161301
qa: -0.0846 -0.0863 -0.2022 -0.2004 -0.2012 -0.1997 -0.3126 0.1159 -0.3392 -0.4077 0.0803 -0.0932 -0.0395 0.0128 0.0037 -0.1804 0.4513 -0.1257 -0.1673 0.0386 0.0999 0.2859 0.0565 0.0778 0.1325 0.1237 0.1383 0.1329 0.1434 0.1248 0.1490 0.1814 0.1300 0.1613
va: 1.2378 1.2171 1.0949 1.0992 1.0861 1.0866 2.0794 3.3572 2.8791 3.0150 3.7321 3.8464 3.8866 3.4558 3.9446 3.9895 4.3366 4.0607 4.0493 4.0605 3.8584 4.1367 4.0472 1.0667 1.0180 1.0106 1.0097 1.0020 1.0055 1.0197 1.0037 0.9925 0.9825 0.9963
dispcorr: -0.019280040 hartree
energy: -2061.450123443316
dipole: -8.27214 9.95019 1.67805 -5.05563 6.19027 1.13464 9.51014 -8.93874 0.57140
magnitude: 2.10470 au
magnitude: 5.34973 debye
