program: Orca
programVersion: 4.2.1
elementType: Cl Cl F F F F O N N N C C C C C C C C C C C C C H H H H H H H H H H H
charge: 0
multiplicity: 1
keywords: wb97x-d3
keywords: def2-TZVPP
keywords: def2/J RIJCOSX GRIDX6 NOFINALGRIDX
keywords: grid4 nofinalgrid
keywords: scfconv7
keywords: smallprint printgap noloewdin
keywords: NOSOSCF
formula: C13H11Cl2F4N3O
InChI: InChI=1S/C13H11Cl2F4N3O/c14-9-1-2-10(11(15)3-9)8(4-22-7-20-6-21-22)5-23-13(18,19)12(16)17/h1-3,6-8,12H,4-5H2
34 atoms
Cl -1.339502 -0.373456 -2.128209
Cl -4.750579 3.197266 -0.103983
F  3.018725 -0.027286 -1.048917
F  4.110599 1.344123 0.205271
F  5.555376 -0.808675 -0.560676
F  4.080938 -2.159709 0.318584
O  2.615288 -0.014125 1.15358
N  -1.010708 -2.16322 0.890307
N  -0.683245 -3.079692 -0.024025
N  -2.912241 -2.974259 0.218707
C  0.265115 -0.096551 0.523915
C  -0.020162 -1.279688 1.457259
C  1.410072 0.761283 1.05818
C  -0.978193 0.736354 0.33319
C  -1.765089 0.673236 -0.815586
C  -1.424765 1.57495 1.353736
C  3.539806 0.113568 0.19586
C  -2.922678 1.423389 -0.962727
C  -2.574141 2.336744 1.238817
C  -2.336582 -2.101391 1.009757
C  -3.312781 2.255155 0.07072
C  4.632106 -0.930262 0.420195
C  -1.852184 -3.535308 -0.390569
H  0.572704 -0.499328 -0.441452
H  0.881797 -1.86225 1.634517
H  -0.386495 -0.934776 2.424427
H  1.546078 1.643374 0.430738
H  1.215707 1.108524 2.072086
H  -0.867349 1.639876 2.279177
H  -3.50849 1.353153 -1.868335
H  -2.884296 2.978713 2.051004
H  -2.832661 -1.432281 1.695374
H  5.113162 -0.820268 1.391822
H  -1.943995 -4.317496 -1.12764
elementType: Cl F O N C H
totalener: -2061.43260783 hartree
nucrepener: 2350.18962038 hartree
electener: -4411.62222821 hartree
oneelecener: -7512.35567088 hartree
twoeener: 3100.73344267 hartree
cpcmener: -0.03647637 hartree
kineticenergy: 2055.87835012 hartree
xcener: -143.923159795397 hartree
chargesum: -0.0000000
charge: -0.080426 -0.084605 -0.199917 -0.199118 -0.200681 -0.199960 -0.319827 0.117183 -0.347024 -0.405271 0.090697 -0.088877 -0.035104 -0.054514 0.033996 -0.167297 0.464028 -0.122597 -0.165168 0.043190 0.099975 0.283085 0.055733 0.072938 0.121841 0.134460 0.140104 0.131758 0.145771 0.125217 0.148627 0.177320 0.124784 0.159678
qa: -0.0804 -0.0846 -0.1999 -0.1991 -0.2007 -0.2000 -0.3198 0.1172 -0.3470 -0.4053 0.0907 -0.0889 -0.0351 -0.0545 0.0340 -0.1673 0.4640 -0.1226 -0.1652 0.0432 0.1000 0.2831 0.0557 0.0729 0.1218 0.1345 0.1401 0.1318 0.1458 0.1252 0.1486 0.1773 0.1248 0.1597
va: 1.2456 1.2191 1.0957 1.1002 1.0851 1.0836 2.0645 3.3589 2.8718 3.0102 3.7056 3.8457 3.8893 3.5063 3.9217 3.9799 4.3147 4.0641 4.0458 4.0730 3.8639 4.1236 4.0569 1.0821 1.0285 0.9988 1.0075 1.0015 1.0050 1.0204 1.0043 0.9923 0.9845 0.9969
dispcorr: -0.019489094 hartree
energy: -2061.452096922291
dipole: -10.12826 10.62691 0.49866 -3.11632 4.89222 1.77591 13.80344 -11.09395 2.70949
magnitude: 3.27778 au
magnitude: 8.33145 debye
