program: Orca
programVersion: 4.2.1
elementType: Cl Cl F F F F O N N N C C C C C C C C C C C C C H H H H H H H H H H H
charge: 0
multiplicity: 1
keywords: wb97x-d3
keywords: def2-TZVPP
keywords: def2/J RIJCOSX GRIDX6 NOFINALGRIDX
keywords: grid4 nofinalgrid
keywords: scfconv7
keywords: smallprint printgap noloewdin
keywords: NOSOSCF
formula: C13H11Cl2F4N3O
InChI: InChI=1S/C13H11Cl2F4N3O/c14-9-1-2-10(11(15)3-9)8(4-22-7-20-6-21-22)5-23-13(18,19)12(16)17/h1-3,6-8,12H,4-5H2
34 atoms
Cl -0.976768 -0.400696 -2.077115
Cl -3.141437 3.656652 0.633564
F  3.812593 -1.056503 -0.284079
F  2.256943 0.151461 -1.162755
F  3.276622 2.389206 0.075386
F  4.69089 1.325331 -1.203435
O  2.381441 0.012046 1.068252
N  -1.657413 -2.748952 0.466121
N  -1.562125 -3.570605 -0.581526
N  -3.614901 -2.671374 -0.474644
C  0.313845 -1.284411 0.615469
C  -0.505698 -2.40941 1.263875
C  1.615317 -1.1510 1.400935
C  -0.499685 -0.016226 0.575966
C  -1.13664 0.44329 -0.573548
C  -0.722568 0.70406 1.74811
C  3.068524 0.058498 -0.079101
C  -1.945051 1.571919 -0.571235
C  -1.525713 1.828913 1.786908
C  -2.876881 -2.209321 0.504771
C  -2.130104 2.255577 0.615715
C  4.011675 1.26098 -0.036611
C  -2.755826 -3.491882 -1.107698
H  0.553263 -1.608337 -0.397123
H  0.098538 -3.307545 1.383331
H  -0.853666 -2.115096 2.25357
H  1.425003 -1.044147 2.467985
H  2.210649 -2.056731 1.274819
H  -0.267017 0.374446 2.673412
H  -2.424593 1.902901 -1.481773
H  -1.678961 2.358513 2.716598
H  -3.188252 -1.51469 1.269191
H  4.715276 1.195223 0.793567
H  -3.025519 -4.062654 -1.982125
elementType: Cl F O N C H
totalener: -2061.43180911 hartree
nucrepener: 2408.67246731 hartree
electener: -4470.10427642 hartree
oneelecener: -7629.74869976 hartree
twoeener: 3159.64442334 hartree
cpcmener: -0.03828031 hartree
kineticenergy: 2055.87921881 hartree
xcener: -143.924583753554 hartree
chargesum: 0.0000000
charge: -0.083102 -0.086631 -0.199893 -0.196149 -0.199921 -0.200938 -0.307963 0.116000 -0.345271 -0.404649 0.065802 -0.109105 -0.054089 -0.016020 0.026299 -0.154308 0.465865 -0.108954 -0.173236 0.041733 0.096550 0.282558 0.055062 0.084965 0.127399 0.137305 0.123127 0.136564 0.145400 0.125281 0.147772 0.177440 0.124115 0.160993
qa: -0.0831 -0.0866 -0.1999 -0.1961 -0.1999 -0.2009 -0.3080 0.1160 -0.3453 -0.4046 0.0658 -0.1091 -0.0541 -0.0160 0.0263 -0.1543 0.4659 -0.1090 -0.1732 0.0417 0.0966 0.2826 0.0551 0.0850 0.1274 0.1373 0.1231 0.1366 0.1454 0.1253 0.1478 0.1774 0.1241 0.1610
va: 1.2386 1.2166 1.1001 1.1012 1.0849 1.0843 2.0659 3.3547 2.8766 3.0127 3.7222 3.9066 3.9333 3.4000 3.9194 3.9794 4.2893 4.0405 4.0519 4.0779 3.8578 4.1366 4.0586 1.0651 1.0130 0.9985 0.9963 1.0037 1.0005 1.0201 1.0044 0.9917 0.9843 0.9961
dispcorr: -0.020183756 hartree
energy: -2061.451992869807
dipole: -9.75978 10.98003 1.22025 -16.33059 15.83323 -0.49736 14.69729 -11.51145 3.18584
magnitude: 3.44760 au
magnitude: 8.76311 debye
