program: Orca
programVersion: 4.2.1
elementType: Cl Cl F F F F O N N N C C C C C C C C C C C C C H H H H H H H H H H H
charge: 0
multiplicity: 1
keywords: wb97x-d3
keywords: def2-TZVPP
keywords: def2/J RIJCOSX GRIDX6 NOFINALGRIDX
keywords: grid4 nofinalgrid
keywords: scfconv7
keywords: smallprint printgap noloewdin
keywords: NOSOSCF
formula: C13H11Cl2F4N3O
InChI: InChI=1S/C13H11Cl2F4N3O/c14-9-1-2-10(11(15)3-9)8(4-22-7-20-6-21-22)5-23-13(18,19)12(16)17/h1-3,6-8,12H,4-5H2
34 atoms
Cl -1.043108 -0.469458 -2.05637
Cl -3.191106 3.668979 0.541025
F  3.379471 -0.931942 -0.574954
F  1.991622 0.66671 -0.990782
F  4.542267 1.446979 -1.224128
F  4.999638 0.769963 0.799971
O  2.354798 0.082278 1.137759
N  -1.630339 -2.763787 0.461372
N  -1.523345 -3.580432 -0.589149
N  -3.602884 -2.747201 -0.450099
C  0.306694 -1.244278 0.632075
C  -0.484806 -2.402331 1.25798
C  1.583969 -1.081852 1.451313
C  -0.539954 0.001735 0.577055
C  -1.198716 0.417667 -0.577805
C  -0.748881 0.761797 1.725751
C  2.897645 0.230018 -0.078042
C  -2.013383 1.540349 -0.603768
C  -1.555482 1.885808 1.735465
C  -2.865504 -2.265189 0.52045
C  -2.180418 2.267359 0.560264
C  4.020554 1.263135 0.008774
C  -2.726695 -3.53735 -1.097379
H  0.579205 -1.554475 -0.37768
H  0.146041 -3.284967 1.357565
H  -0.83628 -2.135336 2.254582
H  1.361807 -0.966392 2.511175
H  2.196142 -1.979981 1.351926
H  -0.275185 0.473554 2.655289
H  -2.507198 1.837119 -1.518435
H  -1.690412 2.451428 2.646371
H  -3.18699 -1.584441 1.293683
H  3.674617 2.216255 0.406562
H  -2.990102 -4.112997 -1.971083
elementType: Cl F O N C H
totalener: -2061.43116931 hartree
nucrepener: 2406.70909815 hartree
electener: -4468.14026746 hartree
oneelecener: -7625.48518741 hartree
twoeener: 3157.34491995 hartree
cpcmener: -0.03699148 hartree
kineticenergy: 2055.88544861 hartree
xcener: -143.926640271759 hartree
chargesum: -0.0000000
charge: -0.082629 -0.086573 -0.197536 -0.197315 -0.200665 -0.201471 -0.315323 0.115080 -0.345391 -0.403658 0.040604 -0.107298 -0.035876 -0.026926 0.031959 -0.149592 0.466339 -0.110774 -0.175953 0.043020 0.100053 0.288523 0.054987 0.089985 0.127039 0.139591 0.120903 0.137160 0.145406 0.124998 0.147509 0.177410 0.125802 0.160611
qa: -0.0826 -0.0866 -0.1975 -0.1973 -0.2007 -0.2015 -0.3153 0.1151 -0.3454 -0.4037 0.0406 -0.1073 -0.0359 -0.0269 0.0320 -0.1496 0.4663 -0.1108 -0.1760 0.0430 0.1001 0.2885 0.0550 0.0900 0.1270 0.1396 0.1209 0.1372 0.1454 0.1250 0.1475 0.1774 0.1258 0.1606
va: 1.2415 1.2167 1.1054 1.0986 1.0844 1.0825 2.0631 3.3573 2.8724 3.0131 3.7311 3.9019 3.9263 3.3820 3.8986 3.9710 4.2686 4.0443 4.0566 4.0756 3.8525 4.1466 4.0583 1.0645 1.0136 0.9977 0.9970 1.0014 1.0003 1.0205 1.0046 0.9920 0.9832 0.9963
dispcorr: -0.020332491 hartree
energy: -2061.451501803504
dipole: -11.51662 11.99396 0.47735 -14.14903 14.41831 0.26929 13.81665 -10.96974 2.84691
magnitude: 2.89918 au
magnitude: 7.36913 debye
