program: Gaussian 09
title: 000030824
version: EM64L-G09RevD.01
frameworkgroup: C1[X(C9H14Br4N6)]
method: RPBEPBE
basis: SDD
operation: Freq
keyword: #p
keyword: freq=noraman
keyword: PBEPBE/SDD
title: #p freq=noraman PBEPBE/SDD
converged: YES YES NO NO
title: Mulliken charges:
elementType: Br Br Br Br N N N N N N C C C C C C C C C H H H H H H H H H H H H H H
charge: 0.002931 0.002770 0.024860 0.024758 -0.129572 -0.150932 -0.151120 -0.130314 -0.587400 -0.587411 -0.362404 -0.361952 -0.429643 -0.429937 0.160553 -0.660799 -0.660725 0.056255 0.056363 0.239833 0.282278 0.282113 0.239689 0.358705 0.359007 0.297443 0.302570 0.297486 0.302441 0.338242 0.337830 0.337824 0.338258
chargesum: 0.00000
title: Mulliken charges with hydrogens summed into heavy atoms:
elementType: Br Br Br Br N N N N N N C C C C C C C C C
charge: 0.002931 0.002770 0.024860 0.024758 -0.129572 -0.150932 -0.151120 -0.130314 0.088672 0.088672 0.159707 0.159849 -0.070938 -0.070930 0.160553 -0.060786 -0.060799 0.056255 0.056363
polarizability: 2.46635715e+02 -2.94319245e-02 2.10032755e+02 -3.01492682e+01 8.48612990e-02 1.87468667e+02
1716.lowfreq: -3.7678 0.0001 0.0004 0.0004 1.9477 3.3565 18.2420 19.6728 26.2804
frequency: 18.0953 19.5699 26.2773 29.6059 40.0963 42.3305 50.7062 72.2804 104.1553 124.7775 144.0177 148.4160 158.3964 186.6823 196.2570 198.1378 222.9348 273.4940 301.7996 318.5998 318.7844 351.1551 375.8745 390.5736 441.2018 492.2880 503.5690 530.7663 532.3064 547.2375 548.2045 572.4048 580.9760 616.3539 635.6520 638.3767 666.4053 710.6805 711.1303 793.0143 853.2628 873.2594 882.7735 883.8607 891.8431 902.9970 979.1947 990.1646 1007.7321 1034.6500 1078.4905 1084.6440 1123.0575 1124.6354 1129.5516 1146.3241 1161.8347 1226.2564 1226.7873 1233.6094 1241.5286 1278.7769 1291.9976 1294.6956 1331.1917 1332.4552 1354.5135 1360.0376 1419.5501 1423.8106 1424.7888 1428.8690 1437.6467 1463.2218 1502.9476 1522.3880 1529.3414 1600.5200 1633.8433 3019.6280 3025.7043 3039.5800 3039.7698 3087.1667 3090.5591 3105.3986 3106.6275 3130.0154 3130.1712 3554.3135 3556.1875 3713.8963 3714.1502
redmass: 27.9739 18.6607 13.0487 12.1447 6.1333 8.0100 13.1959 10.9197 26.8224 7.3995 15.4593 4.8970 3.4173 6.6235 8.5606 6.3219 2.5594 7.9946 2.9076 3.1846 3.1088 4.8000 2.1996 3.1403 4.2441 1.1911 1.2266 4.2962 3.9024 1.0695 1.0290 6.0286 4.7384 3.7681 4.9092 3.6064 4.0270 8.6083 11.2469 11.8313 3.0437 1.9717 1.5208 1.5653 3.7677 5.5173 2.4330 3.6045 3.6258 3.0125 1.8995 1.7826 1.3373 1.4056 2.3922 1.7393 1.5766 1.2933 1.2168 1.8798 1.6026 3.7701 1.3775 1.5156 1.3220 1.2853 1.2199 1.2575 1.4278 2.5424 1.1237 1.2604 1.3292 1.9794 4.5145 4.4174 1.8505 1.4610 2.2286 1.0593 1.0593 1.0566 1.0566 1.1021 1.1006 1.0916 1.0929 1.1067 1.1067 1.0442 1.0447 1.1059 1.1058
irintensity: 0.0824 0.2847 0.1710 1.3418 0.0322 0.0524 0.2117 0.4394 0.0415 0.7867 0.2609 3.2854 4.4073 6.7338 0.8829 4.9655 4.5259 5.8241 3.9251 1.5861 8.4429 0.0568 10.4527 26.7505 11.9183 0.1236 560.3349 13.3659 8.4090 15.6009 0.1040 41.8031 0.2849 25.5782 0.3349 5.5212 17.7944 3.7280 0.0764 49.2381 26.9723 16.3212 6.1713 46.5597 14.0070 4.9264 15.1338 18.0738 3.2842 4.9449 32.9199 0.8115 8.7682 0.0361 0.3969 12.8847 45.5522 36.7289 27.4618 44.8638 0.1171 10.3566 9.2255 16.7406 95.9294 25.4106 9.4895 64.9828 123.5202 1.8969 9.0277 6.5356 20.6328 0.0258 1285.0068 571.1071 61.7707 639.5611 170.5784 15.7469 30.3811 22.1227 5.1369 2.4029 7.1075 3.6620 0.6669 0.9566 3.4927 147.2532 81.1641 20.2851 77.2517
temp: 298.150 k
press: 1.00000 atm
elementType: 35 35 35 35 7 7 7 7 7 7 6 6 6 6 6 6 6 6 6 1 1 1 1 1 1 1 1 1 1 1 1 1 1
symmnumber: 1
zpe: 637931.4 jmol-1
zpe.correction: 0.242975 hartree
zpe.thermalcorrener: 0.264523 hartree
zpe.thermalcorrenthalpy: 0.265468 hartree
zpe.thermalcorrgfe: 0.185559 hartree
zpe.sumelectzpe: -732.300747 hartree
zpe.sumelectthermal: -732.279199 hartree
zpe.sumelectthermalent: -732.278254 hartree
zpe.sumelectthermalfe: -732.358162 hartree
dipole: 0.0027 3.2644 -0.0036
dipole: 3.2644
quadrupole: -176.3160 -130.3687 -150.6528
quadrupole: 0.0124 -8.2742 -0.0572
quadrupole: -23.8702 22.0772 1.7930 0.0124 -8.2742 -0.0572
hfenergy: -732.5437219 hartree
pointgroup: C01 [X(C9H14Br4N6)]
dipole: 1.2842899 0.0064004 -0.0015264 debye
polarizability: 210.0337631|-0.2073722|252.0915569|-0.0633265|23.5868376|182.0118173 unknown
InChI: InChI=1S/C9H14Br4N6/c10-1-5(12)3-19(4-6(13)2-11)9-17-7(14)16-8(15)18-9/h5-6H,1-4,14-15H2
charge 0 multiplicity 1
33 atoms
Br -2.33263 3.629762 1.531044
Br -2.309145 -3.645648 -1.521343
Br -1.782743 4.216385 -2.117445
Br -1.723072 -4.235735 2.1224
N  -0.668593 -0.002441 0.004238
N  1.345934 0.981324 0.730557
N  1.348921 -0.968938 -0.736204
N  3.46656 0.0144 -0.009421
N  3.400193 1.864007 1.422049
N  3.405574 -1.835872 -1.440303
C  -1.398736 0.983498 0.826834
C  -1.395818 -0.992299 -0.816157
C  -1.400144 2.403949 0.194806
C  -1.37851 -2.414587 -0.188749
C  0.723205 0.003783 -0.000902
C  -2.097337 2.46519 -1.157711
C  -2.064818 -2.486324 1.168894
C  2.720478 0.924496 0.694383
C  2.723202 -0.901435 -0.708607
H  -2.435914 0.631361 0.967349
H  -0.916154 1.067675 1.814925
H  -0.920929 -1.068616 -1.808662
H  -2.437499 -0.64965 -0.946737
H  -0.368592 2.784374 0.15452
H  -0.342992 -2.784842 -0.157433
H  -3.190597 2.363346 -1.082298
H  -1.675365 1.704617 -1.835463
H  -3.159702 -2.396788 1.101852
H  -1.646373 -1.722128 1.844799
H  2.878924 2.55431 1.956425
H  4.416814 1.856336 1.411484
H  4.422153 -1.82041 -1.436083
H  2.886305 -2.530402 -1.971139
