program: Orca
programVersion: 4.2.1
elementType: Cl Cl F F F F O N N N C C C C C C C C C C C C C H H H H H H H H H H H
charge: 0
multiplicity: 1
keywords: wb97x-d3
keywords: def2-TZVPP
keywords: def2/J RIJCOSX GRIDX6 NOFINALGRIDX
keywords: grid4 nofinalgrid
keywords: scfconv7
keywords: smallprint printgap noloewdin
keywords: NOSOSCF
formula: C13H11Cl2F4N3O
InChI: InChI=1S/C13H11Cl2F4N3O/c14-9-1-2-10(11(15)3-9)8(4-22-7-20-6-21-22)5-23-13(18,19)12(16)17/h1-3,6-8,12H,4-5H2
34 atoms
Cl -1.307057 -0.332965 -2.112325
Cl -4.732505 3.219553 -0.081981
F  3.0016 0.061819 -1.041934
F  4.139301 1.353259 0.255713
F  5.532537 -0.789179 -0.616268
F  4.02986 -2.150473 0.196482
O  2.628101 -0.012941 1.165539
N  -0.997017 -2.154638 0.89234
N  -0.656271 -3.07484 -0.012884
N  -2.887884 -2.977101 0.205105
C  0.276677 -0.080529 0.553724
C  -0.015124 -1.2720 1.474294
C  1.42251 0.766026 1.103314
C  -0.963926 0.754977 0.362181
C  -1.740612 0.704186 -0.794261
C  -1.419002 1.582627 1.387783
C  3.541441 0.136686 0.200393
C  -2.896169 1.456501 -0.944129
C  -2.568025 2.344837 1.27099
C  -2.324491 -2.097746 0.997548
C  -3.295808 2.276465 0.09518
C  4.611654 -0.941364 0.3614
C  -1.818953 -3.538609 -0.388578
H  0.589498 -0.474815 -0.413221
H  0.886795 -1.853119 1.655707
H  -0.390909 -0.934958 2.440549
H  1.554581 1.666275 0.501348
H  1.235739 1.083111 2.128707
H  -0.8690 1.637234 2.318424
H  -3.473205 1.396697 -1.856162
H  -2.887091 2.977125 2.087441
H  -2.831496 -1.426672 1.673423
H  5.098832 -0.897161 1.335168
H  -1.900075 -4.32586 -1.121645
elementType: Cl F O N C H
totalener: -2061.43265433 hartree
nucrepener: 2351.34853694 hartree
electener: -4412.78119127 hartree
oneelecener: -7514.68281181 hartree
twoeener: 3101.90162054 hartree
cpcmener: -0.03651064 hartree
kineticenergy: 2055.87874800 hartree
xcener: -143.923080878397 hartree
chargesum: -0.0000000
charge: -0.080633 -0.084582 -0.199735 -0.199223 -0.200259 -0.200548 -0.319818 0.116656 -0.346064 -0.405678 0.090547 -0.089621 -0.032476 -0.055644 0.033950 -0.166843 0.464204 -0.122790 -0.165571 0.043412 0.100086 0.282783 0.056116 0.072418 0.122201 0.134735 0.139845 0.130883 0.145804 0.125279 0.148727 0.177332 0.124766 0.159741
qa: -0.0806 -0.0846 -0.1997 -0.1992 -0.2003 -0.2005 -0.3198 0.1167 -0.3461 -0.4057 0.0905 -0.0896 -0.0325 -0.0556 0.0339 -0.1668 0.4642 -0.1228 -0.1656 0.0434 0.1001 0.2828 0.0561 0.0724 0.1222 0.1347 0.1398 0.1309 0.1458 0.1253 0.1487 0.1773 0.1248 0.1597
va: 1.2454 1.2192 1.0957 1.1001 1.0856 1.0827 2.0646 3.3602 2.8731 3.0111 3.7053 3.8445 3.8884 3.5024 3.9233 3.9793 4.3142 4.0639 4.0467 4.0733 3.8638 4.1244 4.0562 1.0828 1.0282 0.9987 1.0079 1.0011 1.0047 1.0204 1.0043 0.9922 0.9846 0.9967
dispcorr: -0.019490877 hartree
energy: -2061.452145208805
dipole: -10.07551 10.56475 0.48924 -3.39852 5.11818 1.71966 14.04126 -11.29817 2.74309
magnitude: 3.27432 au
magnitude: 8.32265 debye
